sling-commits mailing list archives

Site index · List index
Message view « Date » · « Thread »
Top « Date » · « Thread »
From Apache Jenkins Server <jenk...@builds.apache.org>
Subject Build failed in Jenkins: sling-org-apache-sling-servlet-helpers-1.8 #31
Date Mon, 07 May 2018 19:48:24 GMT
See <https://builds.apache.org/job/sling-org-apache-sling-servlet-helpers-1.8/31/display/redirect?page=changes>

Changes:

[jeb] SLING-7657 allows the responseContentType to be set

------------------------------------------
Started by an SCM change
[EnvInject] - Loading node environment variables.
Building remotely on ubuntu-6 (ubuntu trusty) in workspace <https://builds.apache.org/job/sling-org-apache-sling-servlet-helpers-1.8/ws/>
 > git rev-parse --is-inside-work-tree # timeout=10
Fetching changes from the remote Git repository
 > git config remote.origin.url https://github.com/apache/sling-org-apache-sling-servlet-helpers.git
# timeout=10
Fetching upstream changes from https://github.com/apache/sling-org-apache-sling-servlet-helpers.git
 > git --version # timeout=10
 > git fetch --tags --progress https://github.com/apache/sling-org-apache-sling-servlet-helpers.git
+refs/heads/*:refs/remotes/origin/*
 > git rev-parse origin/master^{commit} # timeout=10
Checking out Revision 2d991de38684ffec35788167fd61617dd9eb1dac (origin/master)
 > git config core.sparsecheckout # timeout=10
 > git checkout -f 2d991de38684ffec35788167fd61617dd9eb1dac
Commit message: "SLING-7657 allows the responseContentType to be set"
 > git rev-list --no-walk 6475fde46875353cdebf816c3487c608307f4ef6 # timeout=10
Parsing POMs
Established TCP socket on 58284
maven33-agent.jar already up to date
maven33-interceptor.jar already up to date
maven3-interceptor-commons.jar already up to date
[sling-org-apache-sling-servlet-helpers-1.8] $ /home/jenkins/tools/java/latest1.8/bin/java
-Xmx2g -Xms256m -cp /home/jenkins/jenkins-slave/maven33-agent.jar:/home/jenkins/tools/maven/apache-maven-3.3.9/boot/plexus-classworlds-2.5.2.jar:/home/jenkins/tools/maven/apache-maven-3.3.9/conf/logging
jenkins.maven3.agent.Maven33Main /home/jenkins/tools/maven/apache-maven-3.3.9 /home/jenkins/jenkins-slave/slave.jar
/home/jenkins/jenkins-slave/maven33-interceptor.jar /home/jenkins/jenkins-slave/maven3-interceptor-commons.jar
58284
<===[JENKINS REMOTING CAPACITY]===>   channel started
Executing Maven:  -B -f <https://builds.apache.org/job/sling-org-apache-sling-servlet-helpers-1.8/ws/pom.xml>
-Dmaven.repo.local=/home/jenkins/jenkins-slave/maven-repositories/0 -U clean deploy
[INFO] Scanning for projects...
[INFO]                                                                         
[INFO] ------------------------------------------------------------------------
[INFO] Building Apache Sling Servlet Helpers 1.1.5-SNAPSHOT
[INFO] ------------------------------------------------------------------------
[INFO] 
[INFO] --- maven-clean-plugin:3.0.0:clean (default-clean) @ org.apache.sling.servlet-helpers
---
[INFO] Deleting <https://builds.apache.org/job/sling-org-apache-sling-servlet-helpers-1.8/ws/target>
[INFO] 
[INFO] --- maven-enforcer-plugin:1.4.1:enforce (enforce-java) @ org.apache.sling.servlet-helpers
---
[INFO] 
[INFO] --- maven-antrun-plugin:1.8:run (set-bundle-required-execution-environment) @ org.apache.sling.servlet-helpers
---
[INFO] Executing tasks

main:
Setting Bundle-RequiredExecutionEnvironment=JavaSE-1.7 from sling.java.version=7
[INFO] Executed tasks
[INFO] 
[INFO] --- maven-remote-resources-plugin:1.5:process (process-resource-bundles) @ org.apache.sling.servlet-helpers
---
[INFO] 
[INFO] --- maven-remote-resources-plugin:1.5:process (default) @ org.apache.sling.servlet-helpers
---
[INFO] 
[INFO] --- maven-resources-plugin:2.7:resources (default-resources) @ org.apache.sling.servlet-helpers
---
[INFO] Using 'UTF-8' encoding to copy filtered resources.
[INFO] skip non existing resourceDirectory <https://builds.apache.org/job/sling-org-apache-sling-servlet-helpers-1.8/ws/src/main/resources>
[INFO] Copying 3 resources
[INFO] Copying 3 resources
[INFO] 
[INFO] --- maven-compiler-plugin:3.5.1:compile (default-compile) @ org.apache.sling.servlet-helpers
---
[INFO] Changes detected - recompiling the module!
[INFO] Compiling 12 source files to <https://builds.apache.org/job/sling-org-apache-sling-servlet-helpers-1.8/ws/target/classes>
[INFO] <https://builds.apache.org/job/sling-org-apache-sling-servlet-helpers-1.8/ws/src/main/java/org/apache/sling/servlethelpers/MockSlingHttpServletResponse.java>:
Some input files use or override a deprecated API.
[INFO] <https://builds.apache.org/job/sling-org-apache-sling-servlet-helpers-1.8/ws/src/main/java/org/apache/sling/servlethelpers/MockSlingHttpServletResponse.java>:
Recompile with -Xlint:deprecation for details.
[INFO] 
[INFO] --- maven-bundle-plugin:3.2.0:manifest (scr-metadata) @ org.apache.sling.servlet-helpers
---
[INFO] 
[INFO] --- maven-resources-plugin:2.7:testResources (default-testResources) @ org.apache.sling.servlet-helpers
---
[INFO] Using 'UTF-8' encoding to copy filtered resources.
[INFO] skip non existing resourceDirectory <https://builds.apache.org/job/sling-org-apache-sling-servlet-helpers-1.8/ws/src/test/resources>
[INFO] Copying 3 resources
[INFO] Copying 3 resources
[INFO] 
[INFO] --- maven-compiler-plugin:3.5.1:testCompile (default-testCompile) @ org.apache.sling.servlet-helpers
---
[INFO] Changes detected - recompiling the module!
[INFO] Compiling 5 source files to <https://builds.apache.org/job/sling-org-apache-sling-servlet-helpers-1.8/ws/target/test-classes>
[INFO] 
[INFO] --- maven-surefire-plugin:2.18.1:test (default-test) @ org.apache.sling.servlet-helpers
---
[INFO] Surefire report directory: <https://builds.apache.org/job/sling-org-apache-sling-servlet-helpers-1.8/ws/target/surefire-reports>

-------------------------------------------------------
 T E S T S
-------------------------------------------------------
Running org.apache.sling.servlethelpers.MockRequestPathInfoTest
Tests run: 4, Failures: 0, Errors: 0, Skipped: 0, Time elapsed: 0.003 sec - in org.apache.sling.servlethelpers.MockRequestPathInfoTest
Running org.apache.sling.servlethelpers.MockServletContextTest
Tests run: 1, Failures: 0, Errors: 0, Skipped: 0, Time elapsed: 0 sec - in org.apache.sling.servlethelpers.MockServletContextTest
Running org.apache.sling.servlethelpers.MockSlingHttpServletRequestTest
Tests run: 32, Failures: 0, Errors: 0, Skipped: 0, Time elapsed: 0.26 sec - in org.apache.sling.servlethelpers.MockSlingHttpServletRequestTest
Running org.apache.sling.servlethelpers.MockSlingHttpServletResponseTest
Tests run: 11, Failures: 0, Errors: 0, Skipped: 0, Time elapsed: 0.01 sec - in org.apache.sling.servlethelpers.MockSlingHttpServletResponseTest
Running org.apache.sling.servlethelpers.MockHttpSessionTest
Tests run: 10, Failures: 0, Errors: 0, Skipped: 0, Time elapsed: 0.001 sec - in org.apache.sling.servlethelpers.MockHttpSessionTest

Results :

Tests run: 58, Failures: 0, Errors: 0, Skipped: 0

[JENKINS] Recording test results
[INFO] 
[INFO] --- animal-sniffer-maven-plugin:1.15:check (default) @ org.apache.sling.servlet-helpers
---
[INFO] Checking unresolved references to org.codehaus.mojo.signature:java17:1.0
[INFO] 
[INFO] --- maven-bundle-plugin:3.2.0:bundle (default-bundle) @ org.apache.sling.servlet-helpers
---
[INFO] 
[INFO] >>> maven-source-plugin:3.0.1:jar (attach-sources) > generate-sources @
org.apache.sling.servlet-helpers >>>
[INFO] 
[INFO] --- maven-enforcer-plugin:1.4.1:enforce (enforce-java) @ org.apache.sling.servlet-helpers
---
[INFO] 
[INFO] --- maven-antrun-plugin:1.8:run (set-bundle-required-execution-environment) @ org.apache.sling.servlet-helpers
---
[INFO] Executing tasks

main:
Setting Bundle-RequiredExecutionEnvironment=JavaSE-1.7 from sling.java.version=7
[INFO] Executed tasks
[WARNING] Failed to getClass for org.apache.maven.plugins.source.SourceJarMojo
[INFO] 
[INFO] <<< maven-source-plugin:3.0.1:jar (attach-sources) < generate-sources @
org.apache.sling.servlet-helpers <<<
[INFO] 
[INFO] --- maven-source-plugin:3.0.1:jar (attach-sources) @ org.apache.sling.servlet-helpers
---
[INFO] Building jar: <https://builds.apache.org/job/sling-org-apache-sling-servlet-helpers-1.8/ws/target/org.apache.sling.servlet-helpers-1.1.5-SNAPSHOT-sources.jar>
[INFO] 
[INFO] --- maven-site-plugin:3.5.1:attach-descriptor (attach-descriptor) @ org.apache.sling.servlet-helpers
---
[INFO] 
[INFO] --- ianal-maven-plugin:1.0-alpha-1:verify-legal-files (default) @ org.apache.sling.servlet-helpers
---
[INFO] Checking legal files in: org.apache.sling.servlet-helpers-1.1.5-SNAPSHOT.jar
[INFO] Checking legal files in: org.apache.sling.servlet-helpers-1.1.5-SNAPSHOT-sources.jar
[INFO] 
[INFO] --- apache-rat-plugin:0.11:check (default) @ org.apache.sling.servlet-helpers ---
[INFO] 51 implicit excludes (use -debug for more details).
[INFO] Exclude: DEPENDENCIES
[INFO] Exclude: src/main/appended-resources/META-INF/*
[INFO] Exclude: velocity.log
[INFO] Exclude: target/*
[INFO] Exclude: README.md
[INFO] Exclude: maven-eclipse.xml
[INFO] Exclude: .*
[INFO] Exclude: .*/**
[INFO] Exclude: **/*.json
[INFO] Exclude: DEPENDENCIES
[INFO] Exclude: **/*.rej
[INFO] Exclude: hs_err_*.log
[INFO] Exclude: **/repository/index/*/index-details.txt
[INFO] 19 resources included (use -debug for more details)
[INFO] Rat check: Summary of files. Unapproved: 0 unknown: 0 generated: 0 approved: 18 licence.
[INFO] 
[INFO] --- maven-bundle-plugin:3.2.0:baseline (baseline) @ org.apache.sling.servlet-helpers
---
[INFO] artifact org.apache.sling:org.apache.sling.servlet-helpers: checking for updates from
Nexus
[INFO] artifact org.apache.sling:org.apache.sling.servlet-helpers: checking for updates from
central
[INFO] Baseline Report - Generated by Apache Felix Maven Bundle Plugin on 2018-05-07T19:48Z
based on Bnd - see http://www.aqute.biz/Bnd/Bnd
[INFO] Comparing bundle org.apache.sling.servlet-helpers version 1.1.5-SNAPSHOT to version
1.1.4
[INFO] 
[INFO]   PACKAGE_NAME                                       DELTA      CUR_VER    BASE_VER
  REC_VER    WARNINGS  
[INFO] = ================================================== ========== ========== ==========
========== ==========
[INFO] * org.apache.sling.servlethelpers                    minor      1.2.0      1.2.0  
   1.3.0      Version increase required
[INFO]      < class org.apache.sling.servlethelpers.MockSlingHttpServletRequest
[INFO]          + method setResponseContentType(java.lang.String)
[INFO] -----------------------------------------------------------------------------------------------------------
[ERROR] org.apache.sling.servlethelpers: Version increase required; detected 1.2.0, suggested
1.3.0
[INFO] Baseline analysis complete, 1 error(s), 0 warning(s)
[JENKINS] Archiving disabled
[JENKINS] Archiving disabled
[INFO] ------------------------------------------------------------------------
[INFO] BUILD FAILURE
[INFO] ------------------------------------------------------------------------
[INFO] Total time: 01:31 min
[INFO] Finished at: 2018-05-07T19:48:22+00:00
[INFO] Final Memory: 48M/641M
[INFO] ------------------------------------------------------------------------
Waiting for Jenkins to finish collecting data
[ERROR] Failed to execute goal org.apache.felix:maven-bundle-plugin:3.2.0:baseline (baseline)
on project org.apache.sling.servlet-helpers: Baseline failed, see generated report -> [Help
1]
[ERROR] 
[ERROR] To see the full stack trace of the errors, re-run Maven with the -e switch.
[ERROR] Re-run Maven using the -X switch to enable full debug logging.
[ERROR] 
[ERROR] For more information about the errors and possible solutions, please read the following
articles:
[ERROR] [Help 1] http://cwiki.apache.org/confluence/display/MAVEN/MojoFailureException
channel stopped
Recording test results

Mime
View raw message