sling-commits mailing list archives

Site index · List index
Message view « Date » · « Thread »
Top « Date » · « Thread »
From Apache Jenkins Server <jenk...@builds.apache.org>
Subject Build failed in Jenkins: sling-slingstart-maven-plugin-1.8 #39
Date Wed, 02 May 2018 05:45:52 GMT
See <https://builds.apache.org/job/sling-slingstart-maven-plugin-1.8/39/display/redirect>

------------------------------------------
Started by timer
[EnvInject] - Loading node environment variables.
Building remotely on H25 (ubuntu xenial) in workspace <https://builds.apache.org/job/sling-slingstart-maven-plugin-1.8/ws/>
Cloning the remote Git repository
Cloning repository https://github.com/apache/sling-slingstart-maven-plugin.git
 > git init <https://builds.apache.org/job/sling-slingstart-maven-plugin-1.8/ws/>
# timeout=10
Fetching upstream changes from https://github.com/apache/sling-slingstart-maven-plugin.git
 > git --version # timeout=10
 > git fetch --tags --progress https://github.com/apache/sling-slingstart-maven-plugin.git
+refs/heads/*:refs/remotes/origin/*
 > git config remote.origin.url https://github.com/apache/sling-slingstart-maven-plugin.git
# timeout=10
 > git config --add remote.origin.fetch +refs/heads/*:refs/remotes/origin/* # timeout=10
 > git config remote.origin.url https://github.com/apache/sling-slingstart-maven-plugin.git
# timeout=10
Fetching upstream changes from https://github.com/apache/sling-slingstart-maven-plugin.git
 > git fetch --tags --progress https://github.com/apache/sling-slingstart-maven-plugin.git
+refs/heads/*:refs/remotes/origin/*
 > git rev-parse origin/master^{commit} # timeout=10
Checking out Revision 21b66c6bc22d08bc98a44e5d32445edefda25c14 (origin/master)
 > git config core.sparsecheckout # timeout=10
 > git checkout -f 21b66c6bc22d08bc98a44e5d32445edefda25c14
Commit message: "Use Configurator 1.0.0"
 > git rev-list --no-walk 21b66c6bc22d08bc98a44e5d32445edefda25c14 # timeout=10
Parsing POMs
Established TCP socket on 33571
maven33-agent.jar already up to date
maven33-interceptor.jar already up to date
maven3-interceptor-commons.jar already up to date
[sling-slingstart-maven-plugin-1.8] $ /home/jenkins/tools/java/latest1.8/bin/java -Xmx2g -Xms256m
-cp /home/jenkins/jenkins-slave/maven33-agent.jar:/home/jenkins/tools/maven/apache-maven-3.3.9/boot/plexus-classworlds-2.5.2.jar:/home/jenkins/tools/maven/apache-maven-3.3.9/conf/logging
jenkins.maven3.agent.Maven33Main /home/jenkins/tools/maven/apache-maven-3.3.9 /home/jenkins/jenkins-slave/slave.jar
/home/jenkins/jenkins-slave/maven33-interceptor.jar /home/jenkins/jenkins-slave/maven3-interceptor-commons.jar
33571
<===[JENKINS REMOTING CAPACITY]===>   channel started
Executing Maven:  -B -f <https://builds.apache.org/job/sling-slingstart-maven-plugin-1.8/ws/pom.xml>
-Dmaven.repo.local=/home/jenkins/jenkins-slave/maven-repositories/0 -U clean deploy
[INFO] Scanning for projects...
[INFO]                                                                         
[INFO] ------------------------------------------------------------------------
[INFO] Building Apache Sling SlingStart Maven Plugin 1.7.17-SNAPSHOT
[INFO] ------------------------------------------------------------------------
[INFO] Downloading: http://repository.apache.org/snapshots/org/apache/sling/org.apache.sling.feature.analyser/0.0.1-SNAPSHOT/maven-metadata.xml
[INFO] Downloading: http://repository.apache.org/snapshots/org/apache/sling/org.apache.sling.feature.analyser/0.0.1-SNAPSHOT/org.apache.sling.feature.analyser-0.0.1-SNAPSHOT.pom
[WARNING] The POM for org.apache.sling:org.apache.sling.feature.analyser:jar:0.0.1-SNAPSHOT
is missing, no dependency information available
[INFO] Downloading: http://repository.apache.org/snapshots/org/apache/sling/org.apache.sling.feature.modelconverter/0.0.1-SNAPSHOT/maven-metadata.xml
[INFO] Downloading: http://repository.apache.org/snapshots/org/apache/sling/org.apache.sling.feature.modelconverter/0.0.1-SNAPSHOT/org.apache.sling.feature.modelconverter-0.0.1-SNAPSHOT.pom
[WARNING] The POM for org.apache.sling:org.apache.sling.feature.modelconverter:jar:0.0.1-SNAPSHOT
is missing, no dependency information available
[INFO] Downloading: http://repository.apache.org/snapshots/org/apache/sling/org.apache.sling.feature.io/0.0.1-SNAPSHOT/maven-metadata.xml
[INFO] Downloading: http://repository.apache.org/snapshots/org/apache/sling/org.apache.sling.feature.io/0.0.1-SNAPSHOT/org.apache.sling.feature.io-0.0.1-SNAPSHOT.pom
[WARNING] The POM for org.apache.sling:org.apache.sling.feature.io:jar:0.0.1-SNAPSHOT is missing,
no dependency information available
[INFO] Downloading: http://repository.apache.org/snapshots/org/apache/sling/org.apache.sling.feature.resolver/0.0.1-SNAPSHOT/maven-metadata.xml
[INFO] Downloading: http://repository.apache.org/snapshots/org/apache/sling/org.apache.sling.feature.resolver/0.0.1-SNAPSHOT/org.apache.sling.feature.resolver-0.0.1-SNAPSHOT.pom
[WARNING] The POM for org.apache.sling:org.apache.sling.feature.resolver:jar:0.0.1-SNAPSHOT
is missing, no dependency information available
[INFO] Downloading: https://repo.maven.apache.org/maven2/org/apache/felix/org.apache.felix.configurator/1.0.0/org.apache.felix.configurator-1.0.0.pom
[INFO] Downloaded: https://repo.maven.apache.org/maven2/org/apache/felix/org.apache.felix.configurator/1.0.0/org.apache.felix.configurator-1.0.0.pom
(7 KB at 18.2 KB/sec)
[INFO] Downloading: https://repo.maven.apache.org/maven2/org/apache/felix/felix-parent/5/felix-parent-5.pom
[INFO] Downloaded: https://repo.maven.apache.org/maven2/org/apache/felix/felix-parent/5/felix-parent-5.pom
(22 KB at 688.7 KB/sec)
[INFO] Downloading: http://repository.apache.org/snapshots/org/apache/sling/org.apache.sling.feature/0.0.1-SNAPSHOT/maven-metadata.xml
[INFO] Downloading: http://repository.apache.org/snapshots/org/apache/sling/org.apache.sling.feature/0.0.1-SNAPSHOT/org.apache.sling.feature-0.0.1-SNAPSHOT.pom
[WARNING] The POM for org.apache.sling:org.apache.sling.feature:jar:0.0.1-SNAPSHOT is missing,
no dependency information available
[INFO] Downloading: http://repository.apache.org/snapshots/org/apache/sling/org.apache.sling.feature.analyser/0.0.1-SNAPSHOT/org.apache.sling.feature.analyser-0.0.1-SNAPSHOT.jar
[INFO] Downloading: http://repository.apache.org/snapshots/org/apache/sling/org.apache.sling.feature.modelconverter/0.0.1-SNAPSHOT/org.apache.sling.feature.modelconverter-0.0.1-SNAPSHOT.jar
[INFO] Downloading: http://repository.apache.org/snapshots/org/apache/sling/org.apache.sling.feature.io/0.0.1-SNAPSHOT/org.apache.sling.feature.io-0.0.1-SNAPSHOT.jar
[INFO] Downloading: http://repository.apache.org/snapshots/org/apache/sling/org.apache.sling.feature.resolver/0.0.1-SNAPSHOT/org.apache.sling.feature.resolver-0.0.1-SNAPSHOT.jar
[INFO] Downloading: http://repository.apache.org/snapshots/org/apache/sling/org.apache.sling.feature/0.0.1-SNAPSHOT/org.apache.sling.feature-0.0.1-SNAPSHOT.jar
[INFO] Downloading: https://repo.maven.apache.org/maven2/org/apache/felix/org.apache.felix.configurator/1.0.0/org.apache.felix.configurator-1.0.0.jar
[INFO] Downloaded: https://repo.maven.apache.org/maven2/org/apache/felix/org.apache.felix.configurator/1.0.0/org.apache.felix.configurator-1.0.0.jar
(280 KB at 4443.0 KB/sec)
[JENKINS] Archiving disabled
[JENKINS] Archiving disabled
[INFO] ------------------------------------------------------------------------
[INFO] BUILD FAILURE
[INFO] ------------------------------------------------------------------------
[INFO] Total time: 14.223 s
[INFO] Finished at: 2018-05-02T05:45:50+00:00
[INFO] Final Memory: 17M/245M
[INFO] ------------------------------------------------------------------------
Waiting for Jenkins to finish collecting data
[ERROR] Failed to execute goal on project slingstart-maven-plugin: Could not resolve dependencies
for project org.apache.sling:slingstart-maven-plugin:maven-plugin:1.7.17-SNAPSHOT: The following
artifacts could not be resolved: org.apache.sling:org.apache.sling.feature.analyser:jar:0.0.1-SNAPSHOT,
org.apache.sling:org.apache.sling.feature.modelconverter:jar:0.0.1-SNAPSHOT, org.apache.sling:org.apache.sling.feature.io:jar:0.0.1-SNAPSHOT,
org.apache.sling:org.apache.sling.feature.resolver:jar:0.0.1-SNAPSHOT, org.apache.sling:org.apache.sling.feature:jar:0.0.1-SNAPSHOT:
Could not find artifact org.apache.sling:org.apache.sling.feature.analyser:jar:0.0.1-SNAPSHOT
in Nexus (http://repository.apache.org/snapshots) -> [Help 1]
[ERROR] 
[ERROR] To see the full stack trace of the errors, re-run Maven with the -e switch.
[ERROR] Re-run Maven using the -X switch to enable full debug logging.
[ERROR] 
[ERROR] For more information about the errors and possible solutions, please read the following
articles:
[ERROR] [Help 1] http://cwiki.apache.org/confluence/display/MAVEN/DependencyResolutionException
channel stopped
Recording test results
Not sending mail to unregistered user david.bosschaert@gmail.com

Mime
View raw message