sling-commits mailing list archives

Site index · List index
Message view « Date » · « Thread »
Top « Date » · « Thread »
From Apache Jenkins Server <jenk...@builds.apache.org>
Subject Build failed in Jenkins: sling-slingstart-maven-plugin-1.8 #40
Date Fri, 04 May 2018 07:33:33 GMT
See <https://builds.apache.org/job/sling-slingstart-maven-plugin-1.8/40/display/redirect?page=changes>

Changes:

[david.bosschaert] Move feature model dependency to 0.1.0-SNAPSHOT

------------------------------------------
Started by an SCM change
[EnvInject] - Loading node environment variables.
Building remotely on H23 (ubuntu xenial) in workspace <https://builds.apache.org/job/sling-slingstart-maven-plugin-1.8/ws/>
 > git rev-parse --is-inside-work-tree # timeout=10
Fetching changes from the remote Git repository
 > git config remote.origin.url https://github.com/apache/sling-slingstart-maven-plugin.git
# timeout=10
Fetching upstream changes from https://github.com/apache/sling-slingstart-maven-plugin.git
 > git --version # timeout=10
 > git fetch --tags --progress https://github.com/apache/sling-slingstart-maven-plugin.git
+refs/heads/*:refs/remotes/origin/*
 > git rev-parse origin/master^{commit} # timeout=10
Checking out Revision 0029bb46cc4f01f1626ffaadab31e10b22fcb27a (origin/master)
 > git config core.sparsecheckout # timeout=10
 > git checkout -f 0029bb46cc4f01f1626ffaadab31e10b22fcb27a
Commit message: "Move feature model dependency to 0.1.0-SNAPSHOT"
 > git rev-list --no-walk 21b66c6bc22d08bc98a44e5d32445edefda25c14 # timeout=10
Parsing POMs
Modules changed, recalculating dependency graph
Established TCP socket on 33229
maven33-agent.jar already up to date
maven33-interceptor.jar already up to date
maven3-interceptor-commons.jar already up to date
[sling-slingstart-maven-plugin-1.8] $ /home/jenkins/tools/java/latest1.8/bin/java -Xmx2g -Xms256m
-cp /home/jenkins/jenkins-slave/maven33-agent.jar:/home/jenkins/tools/maven/apache-maven-3.3.9/boot/plexus-classworlds-2.5.2.jar:/home/jenkins/tools/maven/apache-maven-3.3.9/conf/logging
jenkins.maven3.agent.Maven33Main /home/jenkins/tools/maven/apache-maven-3.3.9 /home/jenkins/jenkins-slave/slave.jar
/home/jenkins/jenkins-slave/maven33-interceptor.jar /home/jenkins/jenkins-slave/maven3-interceptor-commons.jar
33229
<===[JENKINS REMOTING CAPACITY]===>   channel started
Executing Maven:  -B -f <https://builds.apache.org/job/sling-slingstart-maven-plugin-1.8/ws/pom.xml>
-Dmaven.repo.local=/home/jenkins/jenkins-slave/maven-repositories/0 -U clean deploy
[INFO] Scanning for projects...
[INFO]                                                                         
[INFO] ------------------------------------------------------------------------
[INFO] Building Apache Sling SlingStart Maven Plugin 1.7.17-SNAPSHOT
[INFO] ------------------------------------------------------------------------
[INFO] Downloading: http://repository.apache.org/snapshots/org/apache/sling/org.apache.sling.feature.analyser/0.1.0-SNAPSHOT/maven-metadata.xml
[INFO] Downloading: http://repository.apache.org/snapshots/org/apache/sling/org.apache.sling.feature.analyser/0.1.0-SNAPSHOT/org.apache.sling.feature.analyser-0.1.0-SNAPSHOT.pom
[WARNING] The POM for org.apache.sling:org.apache.sling.feature.analyser:jar:0.1.0-SNAPSHOT
is missing, no dependency information available
[INFO] Downloading: http://repository.apache.org/snapshots/org/apache/sling/org.apache.sling.feature.modelconverter/0.1.0-SNAPSHOT/maven-metadata.xml
[INFO] Downloading: http://repository.apache.org/snapshots/org/apache/sling/org.apache.sling.feature.modelconverter/0.1.0-SNAPSHOT/org.apache.sling.feature.modelconverter-0.1.0-SNAPSHOT.pom
[WARNING] The POM for org.apache.sling:org.apache.sling.feature.modelconverter:jar:0.1.0-SNAPSHOT
is missing, no dependency information available
[INFO] Downloading: http://repository.apache.org/snapshots/org/apache/sling/org.apache.sling.feature.io/0.1.0-SNAPSHOT/maven-metadata.xml
[INFO] Downloading: http://repository.apache.org/snapshots/org/apache/sling/org.apache.sling.feature.io/0.1.0-SNAPSHOT/org.apache.sling.feature.io-0.1.0-SNAPSHOT.pom
[WARNING] The POM for org.apache.sling:org.apache.sling.feature.io:jar:0.1.0-SNAPSHOT is missing,
no dependency information available
[INFO] Downloading: http://repository.apache.org/snapshots/org/apache/sling/org.apache.sling.feature/0.1.0-SNAPSHOT/maven-metadata.xml
[INFO] Downloaded: http://repository.apache.org/snapshots/org/apache/sling/org.apache.sling.feature/0.1.0-SNAPSHOT/maven-metadata.xml
(1004 B at 3.3 KB/sec)
[INFO] Downloading: http://repository.apache.org/snapshots/org/apache/sling/org.apache.sling.feature/0.1.0-SNAPSHOT/org.apache.sling.feature-0.1.0-20180503.075814-1.pom
[INFO] Downloaded: http://repository.apache.org/snapshots/org/apache/sling/org.apache.sling.feature/0.1.0-SNAPSHOT/org.apache.sling.feature-0.1.0-20180503.075814-1.pom
(4 KB at 13.3 KB/sec)
[INFO] Downloading: http://repository.apache.org/snapshots/org/apache/sling/org.apache.sling.feature.analyser/0.1.0-SNAPSHOT/org.apache.sling.feature.analyser-0.1.0-SNAPSHOT.jar
[INFO] Downloading: http://repository.apache.org/snapshots/org/apache/sling/org.apache.sling.feature.modelconverter/0.1.0-SNAPSHOT/org.apache.sling.feature.modelconverter-0.1.0-SNAPSHOT.jar
[INFO] Downloading: http://repository.apache.org/snapshots/org/apache/sling/org.apache.sling.feature.io/0.1.0-SNAPSHOT/org.apache.sling.feature.io-0.1.0-SNAPSHOT.jar
[INFO] Downloading: http://repository.apache.org/snapshots/org/apache/sling/org.apache.sling.feature/0.1.0-SNAPSHOT/org.apache.sling.feature-0.1.0-20180503.075814-1.jar
[INFO] Downloaded: http://repository.apache.org/snapshots/org/apache/sling/org.apache.sling.feature/0.1.0-SNAPSHOT/org.apache.sling.feature-0.1.0-20180503.075814-1.jar
(46 KB at 110.2 KB/sec)
[JENKINS] Archiving disabled
[JENKINS] Archiving disabled
[INFO] ------------------------------------------------------------------------
[INFO] BUILD FAILURE
[INFO] ------------------------------------------------------------------------
[INFO] Total time: 13.921 s
[INFO] Finished at: 2018-05-04T07:33:31+00:00
[INFO] Final Memory: 16M/298M
[INFO] ------------------------------------------------------------------------
Waiting for Jenkins to finish collecting data
[ERROR] Failed to execute goal on project slingstart-maven-plugin: Could not resolve dependencies
for project org.apache.sling:slingstart-maven-plugin:maven-plugin:1.7.17-SNAPSHOT: The following
artifacts could not be resolved: org.apache.sling:org.apache.sling.feature.analyser:jar:0.1.0-SNAPSHOT,
org.apache.sling:org.apache.sling.feature.modelconverter:jar:0.1.0-SNAPSHOT, org.apache.sling:org.apache.sling.feature.io:jar:0.1.0-SNAPSHOT:
Could not find artifact org.apache.sling:org.apache.sling.feature.analyser:jar:0.1.0-SNAPSHOT
in Nexus (http://repository.apache.org/snapshots) -> [Help 1]
[ERROR] 
[ERROR] To see the full stack trace of the errors, re-run Maven with the -e switch.
[ERROR] Re-run Maven using the -X switch to enable full debug logging.
[ERROR] 
[ERROR] For more information about the errors and possible solutions, please read the following
articles:
[ERROR] [Help 1] http://cwiki.apache.org/confluence/display/MAVEN/DependencyResolutionException
channel stopped
Recording test results
ERROR: Step ?Publish JUnit test result report? failed: Test reports were found but none of
them are new. Did leafNodes run? 
For example, <https://builds.apache.org/job/sling-slingstart-maven-plugin-1.8/ws/target/failsafe-reports/TEST-org.apache.sling.maven.slingstart.DependencyLifecycleParticipantIT.xml>
is 9 days 1 hr old

Not sending mail to unregistered user david.bosschaert@gmail.com

Mime
View raw message