sling-commits mailing list archives

Site index · List index
Message view « Date » · « Thread »
Top « Date » · « Thread »
From Apache Jenkins Server <jenk...@builds.apache.org>
Subject Build failed in Jenkins: sling-org-apache-sling-launchpad-testing-10 #50
Date Sun, 01 Apr 2018 07:28:53 GMT
See <https://builds.apache.org/job/sling-org-apache-sling-launchpad-testing-10/50/display/redirect>

------------------------------------------
[...truncated 2.29 KB...]
 > git rev-parse origin/master^{commit} # timeout=10
Checking out Revision 8325d11b2c094ab9fef235abc07e6f1c7c915f50 (origin/master)
 > git config core.sparsecheckout # timeout=10
 > git checkout -f 8325d11b2c094ab9fef235abc07e6f1c7c915f50
Commit message: "SLING-7353 Update to Sling Parent 33"
 > git rev-list --no-walk 8325d11b2c094ab9fef235abc07e6f1c7c915f50 # timeout=10
Parsing POMs
Established TCP socket on 53961
maven33-agent.jar already up to date
maven33-interceptor.jar already up to date
maven3-interceptor-commons.jar already up to date
[sling-org-apache-sling-launchpad-testing-10] $ /home/jenkins/tools/java/jdk-10-ea+36/bin/java
-Xmx2g -Xms256m -cp /home/jenkins/jenkins-slave/maven33-agent.jar:/home/jenkins/tools/maven/apache-maven-3.3.9/boot/plexus-classworlds-2.5.2.jar:/home/jenkins/tools/maven/apache-maven-3.3.9/conf/logging
jenkins.maven3.agent.Maven33Main /home/jenkins/tools/maven/apache-maven-3.3.9 /home/jenkins/jenkins-slave/slave.jar
/home/jenkins/jenkins-slave/maven33-interceptor.jar /home/jenkins/jenkins-slave/maven3-interceptor-commons.jar
53961
<===[JENKINS REMOTING CAPACITY]===>   channel started
WARNING: An illegal reflective access operation has occurred
WARNING: Illegal reflective access by hudson.remoting.RemoteClassLoader (file:/home/jenkins/jenkins-slave/slave.jar)
to method java.lang.ClassLoader.getClassLoadingLock(java.lang.String)
WARNING: Please consider reporting this to the maintainers of hudson.remoting.RemoteClassLoader
WARNING: Use --illegal-access=warn to enable warnings of further illegal reflective access
operations
WARNING: All illegal access operations will be denied in a future release
Executing Maven:  -B -f <https://builds.apache.org/job/sling-org-apache-sling-launchpad-testing-10/ws/pom.xml>
-Dmaven.repo.local=/home/jenkins/jenkins-slave/maven-repositories/1 -U clean verify
[INFO] Scanning for projects...
[INFO] Downloading: http://repository.apache.org/snapshots/org/apache/sling/org.apache.sling.launchpad.test-bundles/0.0.5-SNAPSHOT/maven-metadata.xml
[INFO] Downloaded: http://repository.apache.org/snapshots/org/apache/sling/org.apache.sling.launchpad.test-bundles/0.0.5-SNAPSHOT/maven-metadata.xml
(1023 B at 2.6 KB/sec)
[INFO] Downloading: http://repository.apache.org/snapshots/org/apache/sling/org.apache.sling.starter/11-SNAPSHOT/maven-metadata.xml
[INFO] Downloaded: http://repository.apache.org/snapshots/org/apache/sling/org.apache.sling.starter/11-SNAPSHOT/maven-metadata.xml
(2 KB at 4.7 KB/sec)
[INFO] Downloading: http://repository.apache.org/snapshots/org/apache/sling/org.apache.sling.sample.slingshot/0.8.1-SNAPSHOT/maven-metadata.xml
[INFO] Downloaded: http://repository.apache.org/snapshots/org/apache/sling/org.apache.sling.sample.slingshot/0.8.1-SNAPSHOT/maven-metadata.xml
(2 KB at 4.6 KB/sec)
[INFO] Extended Maven classpath (scope 'provided') by the dependencies extracted from the
Sling model.
[INFO]                                                                         
[INFO] ------------------------------------------------------------------------
[INFO] Building Apache Sling Launchpad Testing 11-SNAPSHOT
[INFO] ------------------------------------------------------------------------
[INFO] Downloading: http://repository.apache.org/snapshots/org/apache/sling/org.apache.sling.launchpad.integration-tests/1.0.7-SNAPSHOT/maven-metadata.xml
[INFO] Downloaded: http://repository.apache.org/snapshots/org/apache/sling/org.apache.sling.launchpad.integration-tests/1.0.7-SNAPSHOT/maven-metadata.xml
(2 KB at 3.3 KB/sec)
[INFO] Downloading: http://repository.apache.org/snapshots/org/apache/sling/org.apache.sling.launchpad.integration-tests/1.0.7-SNAPSHOT/org.apache.sling.launchpad.integration-tests-1.0.7-20180401.072703-36.pom
[INFO] Downloaded: http://repository.apache.org/snapshots/org/apache/sling/org.apache.sling.launchpad.integration-tests/1.0.7-SNAPSHOT/org.apache.sling.launchpad.integration-tests-1.0.7-20180401.072703-36.pom
(12 KB at 35.1 KB/sec)
[INFO] Downloading: http://repository.apache.org/snapshots/org/apache/sling/org.apache.sling.junit.teleporter/1.0.17-SNAPSHOT/maven-metadata.xml
[INFO] Downloaded: http://repository.apache.org/snapshots/org/apache/sling/org.apache.sling.junit.teleporter/1.0.17-SNAPSHOT/maven-metadata.xml
(1021 B at 3.3 KB/sec)
[INFO] Downloading: http://repository.apache.org/snapshots/org/apache/sling/org.apache.sling.junit.teleporter/1.0.17-SNAPSHOT/org.apache.sling.junit.teleporter-1.0.17-20180401.072550-24.pom
[INFO] Downloaded: http://repository.apache.org/snapshots/org/apache/sling/org.apache.sling.junit.teleporter/1.0.17-SNAPSHOT/org.apache.sling.junit.teleporter-1.0.17-20180401.072550-24.pom
(6 KB at 17.7 KB/sec)
[INFO] Downloading: http://repository.apache.org/snapshots/org/apache/sling/org.apache.sling.launchpad.test-services/2.0.15-SNAPSHOT/maven-metadata.xml
[INFO] Downloaded: http://repository.apache.org/snapshots/org/apache/sling/org.apache.sling.launchpad.test-services/2.0.15-SNAPSHOT/maven-metadata.xml
(2 KB at 3.2 KB/sec)
[INFO] Downloading: http://repository.apache.org/snapshots/org/apache/sling/org.apache.sling.launchpad.test-fragment/2.0.15-SNAPSHOT/maven-metadata.xml
[INFO] Downloaded: http://repository.apache.org/snapshots/org/apache/sling/org.apache.sling.launchpad.test-fragment/2.0.15-SNAPSHOT/maven-metadata.xml
(2 KB at 3.0 KB/sec)
[INFO] Downloading: http://repository.apache.org/snapshots/org/apache/sling/org.apache.sling.launchpad.test-fragment/2.0.15-SNAPSHOT/org.apache.sling.launchpad.test-fragment-2.0.15-20180401.001552-15.pom
[INFO] Downloaded: http://repository.apache.org/snapshots/org/apache/sling/org.apache.sling.launchpad.test-fragment/2.0.15-SNAPSHOT/org.apache.sling.launchpad.test-fragment-2.0.15-20180401.001552-15.pom
(3 KB at 9.3 KB/sec)
[INFO] Downloading: http://repository.apache.org/snapshots/org/apache/sling/org.apache.sling.launchpad.test-services-war/2.0.15-SNAPSHOT/maven-metadata.xml
[INFO] Downloaded: http://repository.apache.org/snapshots/org/apache/sling/org.apache.sling.launchpad.test-services-war/2.0.15-SNAPSHOT/maven-metadata.xml
(2 KB at 3.1 KB/sec)
[INFO] Downloading: http://repository.apache.org/snapshots/org/apache/sling/org.apache.sling.auth.form/1.0.9-SNAPSHOT/maven-metadata.xml
[INFO] Downloaded: http://repository.apache.org/snapshots/org/apache/sling/org.apache.sling.auth.form/1.0.9-SNAPSHOT/maven-metadata.xml
(1018 B at 2.8 KB/sec)
[INFO] Downloading: http://repository.apache.org/snapshots/org/apache/sling/org.apache.sling.starter.content/1.0.0-SNAPSHOT/maven-metadata.xml
[INFO] Downloaded: http://repository.apache.org/snapshots/org/apache/sling/org.apache.sling.starter.content/1.0.0-SNAPSHOT/maven-metadata.xml
(1016 B at 3.0 KB/sec)
[INFO] Downloading: http://repository.apache.org/snapshots/org/apache/sling/org.apache.sling.launchpad.integration-tests/1.0.7-SNAPSHOT/org.apache.sling.launchpad.integration-tests-1.0.7-20180401.072703-36.jar
[INFO] Downloading: http://repository.apache.org/snapshots/org/apache/sling/org.apache.sling.junit.teleporter/1.0.17-SNAPSHOT/org.apache.sling.junit.teleporter-1.0.17-20180401.072550-24.jar
[INFO] Downloading: http://repository.apache.org/snapshots/org/apache/sling/org.apache.sling.launchpad.test-fragment/2.0.15-SNAPSHOT/org.apache.sling.launchpad.test-fragment-2.0.15-20180401.001552-15.jar
[INFO] Downloaded: http://repository.apache.org/snapshots/org/apache/sling/org.apache.sling.launchpad.test-fragment/2.0.15-SNAPSHOT/org.apache.sling.launchpad.test-fragment-2.0.15-20180401.001552-15.jar
(9 KB at 29.3 KB/sec)
[INFO] Downloaded: http://repository.apache.org/snapshots/org/apache/sling/org.apache.sling.junit.teleporter/1.0.17-SNAPSHOT/org.apache.sling.junit.teleporter-1.0.17-20180401.072550-24.jar
(37 KB at 99.9 KB/sec)
[INFO] Downloaded: http://repository.apache.org/snapshots/org/apache/sling/org.apache.sling.launchpad.integration-tests/1.0.7-SNAPSHOT/org.apache.sling.launchpad.integration-tests-1.0.7-20180401.072703-36.jar
(485 KB at 751.6 KB/sec)
[INFO] 
[INFO] --- maven-clean-plugin:3.0.0:clean (default-clean) @ org.apache.sling.launchpad.testing
---
[INFO] Deleting <https://builds.apache.org/job/sling-org-apache-sling-launchpad-testing-10/ws/target>
[INFO] 
[INFO] --- maven-enforcer-plugin:3.0.0-M1:enforce (enforce-property-values) @ org.apache.sling.launchpad.testing
---
[INFO] 
[INFO] --- maven-enforcer-plugin:3.0.0-M1:enforce (enforce-java) @ org.apache.sling.launchpad.testing
---
[INFO] 
[INFO] --- maven-enforcer-plugin:3.0.0-M1:enforce (ban-maven-scr-plugin) @ org.apache.sling.launchpad.testing
---
[INFO] 
[INFO] --- maven-remote-resources-plugin:1.5:process (process-resource-bundles) @ org.apache.sling.launchpad.testing
---
[INFO] 
[INFO] --- maven-remote-resources-plugin:1.5:process (default) @ org.apache.sling.launchpad.testing
---
[INFO] 
[INFO] --- maven-resources-plugin:2.7:resources (default-resources) @ org.apache.sling.launchpad.testing
---
[INFO] Using 'UTF-8' encoding to copy filtered resources.
[INFO] skip non existing resourceDirectory <https://builds.apache.org/job/sling-org-apache-sling-launchpad-testing-10/ws/src/main/resources>
[INFO] Copying 3 resources
[INFO] Copying 3 resources
[INFO] 
[INFO] --- build-helper-maven-plugin:3.0.0:reserve-network-port (reserve-network-port) @ org.apache.sling.launchpad.testing
---
[INFO] Port assigned41000
[INFO] Reserved port 41000 for http.port
[INFO] Port assigned41001
[INFO] Reserved port 41001 for sling.control.port
[INFO] 
[INFO] --- maven-compiler-plugin:3.7.0:compile (default-compile) @ org.apache.sling.launchpad.testing
---
[INFO] No sources to compile
[INFO] 
[INFO] --- maven-resources-plugin:2.7:testResources (default-testResources) @ org.apache.sling.launchpad.testing
---
[INFO] Using 'UTF-8' encoding to copy filtered resources.
[INFO] Copying 1 resource
[INFO] Copying 3 resources
[INFO] Copying 3 resources
[INFO] 
[INFO] --- maven-compiler-plugin:3.7.0:testCompile (default-testCompile) @ org.apache.sling.launchpad.testing
---
[INFO] No sources to compile
[INFO] 
[INFO] --- maven-surefire-plugin:2.20.1:test (default-test) @ org.apache.sling.launchpad.testing
---
[JENKINS] Recording test results
[INFO] 
[INFO] --- slingstart-maven-plugin:1.7.16:prepare-package (default-prepare-package) @ org.apache.sling.launchpad.testing
---
[INFO] 
[INFO] --- slingstart-maven-plugin:1.7.16:attach-slingfeature (default-attach-slingfeature)
@ org.apache.sling.launchpad.testing ---
[INFO] 
[INFO] --- slingstart-maven-plugin:1.7.16:package (default-package) @ org.apache.sling.launchpad.testing
---
[INFO] Packaging standalone jar...
[INFO] Building zip: <https://builds.apache.org/job/sling-org-apache-sling-launchpad-testing-10/ws/target/org.apache.sling.launchpad.testing-11-SNAPSHOT.jar>
[INFO] 
[INFO] >>> maven-source-plugin:3.0.1:jar (attach-sources) > generate-sources @
org.apache.sling.launchpad.testing >>>
[INFO] 
[INFO] --- maven-enforcer-plugin:3.0.0-M1:enforce (enforce-property-values) @ org.apache.sling.launchpad.testing
---
[INFO] 
[INFO] --- maven-enforcer-plugin:3.0.0-M1:enforce (enforce-java) @ org.apache.sling.launchpad.testing
---
[INFO] 
[INFO] --- maven-enforcer-plugin:3.0.0-M1:enforce (ban-maven-scr-plugin) @ org.apache.sling.launchpad.testing
---
[WARNING] Failed to getClass for org.apache.maven.plugins.source.SourceJarMojo
[INFO] 
[INFO] <<< maven-source-plugin:3.0.1:jar (attach-sources) < generate-sources @
org.apache.sling.launchpad.testing <<<
[INFO] 
[INFO] --- maven-source-plugin:3.0.1:jar (attach-sources) @ org.apache.sling.launchpad.testing
---
[INFO] Building jar: <https://builds.apache.org/job/sling-org-apache-sling-launchpad-testing-10/ws/target/org.apache.sling.launchpad.testing-11-SNAPSHOT-sources.jar>
[INFO] 
[INFO] --- maven-site-plugin:3.5.1:attach-descriptor (attach-descriptor) @ org.apache.sling.launchpad.testing
---
[INFO] 
[INFO] --- slingstart-maven-plugin:1.7.16:start (start-container) @ org.apache.sling.launchpad.testing
---
[INFO] Using launchpad jar being generated as this project's primary artifact: '<https://builds.apache.org/job/sling-org-apache-sling-launchpad-testing-10/ws/target/org.apache.sling.launchpad.testing-11-SNAPSHOT.jar'!>
[INFO] Starting Launchpad _-41000...
-------------------------------------------------------------------
Slingstart application: <https://builds.apache.org/job/sling-org-apache-sling-launchpad-testing-10/ws/target/_-41000/org.apache.sling.launchpad.testing-11-SNAPSHOT.jar>
Main class: org.apache.sling.launchpad.app.Main
Listener Port: 34805
Arguments: [-p, 41000, -j, 41001]
-------------------------------------------------------------------
01.04.2018 07:28:27.898 *INFO * [main] Setting sling.home=sling (default)
01.04.2018 07:28:27.901 *INFO * [main] Starting Apache Sling in <https://builds.apache.org/job/sling-org-apache-sling-launchpad-testing-10/ws/target/_-41000/sling>
01.04.2018 07:28:27.904 *INFO * [main] Sling  Extension Lib Home : <https://builds.apache.org/job/sling-org-apache-sling-launchpad-testing-10/ws/target/_-41000/sling/ext>
01.04.2018 07:28:27.904 *INFO * [main] Checking launcher JAR in folder <https://builds.apache.org/job/sling-org-apache-sling-launchpad-testing-10/ws/target/_-41000/sling>
01.04.2018 07:28:27.917 *INFO * [main] Installing new launcher: jar:<https://builds.apache.org/job/sling-org-apache-sling-launchpad-testing-10/ws/target/_-41000/org.apache.sling.launchpad.testing-11-SNAPSHOT.jar!/resources/org.apache.sling.launchpad.base.jar,>
5.6.10.2_6_26 (org.apache.sling.launchpad.base.jar.1522567707917)
01.04.2018 07:28:27.918 *INFO * [main] Loading launcher class org.apache.sling.launchpad.base.app.MainDelegate
from org.apache.sling.launchpad.base.jar.1522567707917
01.04.2018 07:28:27.919 *INFO * [main] External Libs Home (ext) is null or does not exists.
01.04.2018 07:28:27.931 *INFO * [main] Setting sling.launchpad=<https://builds.apache.org/job/sling-org-apache-sling-launchpad-testing-10/ws/target/_-41000/sling>
01.04.2018 07:28:27.931 *INFO * [main] Setting org.osgi.service.http.port=41000
01.04.2018 07:28:27.931 *INFO * [main] Setting sling.control.socket=41001
01.04.2018 07:28:27.931 *INFO * [main] Starting launcher ...
01.04.2018 07:28:27.940 *INFO * [main] HTTP server port: 41000
WARNING: An illegal reflective access operation has occurred
WARNING: Illegal reflective access by org.apache.felix.framework.ext.ClassPathExtenderFactory$DefaultClassLoaderExtender
(<https://builds.apache.org/job/sling-org-apache-sling-launchpad-testing-10/ws/target/_-41000/sling/org.apache.sling.launchpad.base.jar.1522567707917)>
to method java.net.URLClassLoader.addURL(java.net.URL)
WARNING: Please consider reporting this to the maintainers of org.apache.felix.framework.ext.ClassPathExtenderFactory$DefaultClassLoaderExtender
WARNING: Use --illegal-access=warn to enable warnings of further illegal reflective access
operations
WARNING: All illegal access operations will be denied in a future release
01.04.2018 07:28:28.652 *INFO* [OsgiInstallerImpl] org.apache.sling.installer.core.impl.OsgiInstallerImpl
Apache Sling OSGi Installer Service started.
01.04.2018 07:28:28.696 *INFO* [FelixStartLevel] org.apache.sling.commons.logservice Service
[org.apache.sling.commons.logservice.internal.LogServiceFactory,17, [org.osgi.service.log.LogService]]
ServiceEvent REGISTERED
01.04.2018 07:28:28.700 *INFO* [FelixStartLevel] org.apache.sling.commons.logservice Service
[org.apache.sling.commons.logservice.internal.LogReaderServiceFactory,18, [org.osgi.service.log.LogReaderService]]
ServiceEvent REGISTERED
01.04.2018 07:28:28.700 *INFO* [FelixStartLevel] org.apache.sling.commons.logservice BundleEvent
STARTED
01.04.2018 07:28:28.708 *INFO* [FelixStartLevel] org.apache.sling.launchpad.installer BundleEvent
RESOLVED
01.04.2018 07:28:28.711 *INFO* [FelixStartLevel] org.apache.sling.launchpad.installer BundleEvent
STARTING
01.04.2018 07:28:28.714 *INFO* [FelixStartLevel] org.apache.sling.launchpad.installer BundleEvent
STARTED
01.04.2018 07:28:28.716 *INFO* [FelixStartLevel] org.apache.geronimo.specs.geronimo-atinject_1.0_spec
BundleEvent RESOLVED
01.04.2018 07:28:28.716 *INFO* [FelixStartLevel] org.apache.geronimo.specs.geronimo-atinject_1.0_spec
BundleEvent STARTING
01.04.2018 07:28:28.717 *INFO* [FelixStartLevel] org.apache.geronimo.specs.geronimo-atinject_1.0_spec
BundleEvent STARTED
01.04.2018 07:28:28.718 *INFO* [FelixStartLevel] org.apache.sling.settings BundleEvent STARTING
01.04.2018 07:28:28.725 *INFO* [FelixStartLevel] org.apache.sling.settings.impl.SlingSettingsServiceImpl
Read Sling ID null from file <https://builds.apache.org/job/sling-org-apache-sling-launchpad-testing-10/ws/target/_-41000/sling/felix/bundle16/data/sling.id.file>
01.04.2018 07:28:28.729 *INFO* [FelixStartLevel] org.apache.sling.settings.impl.SlingSettingsServiceImpl
Created new Sling ID abb04b0e-caf9-4631-a0f0-40dc79e7399c
01.04.2018 07:28:28.734 *INFO* [FelixStartLevel] org.apache.sling.settings.impl.SlingSettingsServiceImpl
Active run modes: [oak_tar]
01.04.2018 07:28:28.736 *INFO* [FelixStartLevel] org.apache.sling.launchpad.installer Service
[Apache Sling Launchpad Startup Listener,20, [org.apache.sling.installer.api.event.InstallationListener]]
ServiceEvent REGISTERED
01.04.2018 07:28:28.738 *INFO* [FelixStartLevel] org.apache.sling.launchpad.installer.impl.LaunchpadConfigInstaller
Activating launchpad config installer, configuration path=resources/config, install path=resources/install
01.04.2018 07:28:28.996 *INFO* [FelixStartLevel] org.apache.sling.launchpad.installer.impl.LaunchpadConfigInstaller
183 resources registered with OsgiInstaller
01.04.2018 07:28:28.997 *INFO* [FelixStartLevel] org.apache.sling.settings Service [Apache
Sling Settings Service,19, [org.apache.sling.settings.SlingSettingsService]] ServiceEvent
REGISTERED
01.04.2018 07:28:28.999 *INFO* [FelixStartLevel] org.apache.sling.settings Service [Apache
Sling Sling Properties Configuration Printer,21, [org.apache.sling.settings.impl.SlingPropertiesPrinter]]
ServiceEvent REGISTERED
01.04.2018 07:28:29.000 *INFO* [FelixStartLevel] org.apache.sling.settings Service [Apache
Sling Sling Settings Configuration Printer,22, [org.apache.sling.settings.impl.SlingSettingsPrinter]]
ServiceEvent REGISTERED
01.04.2018 07:28:29.002 *INFO* [FelixStartLevel] org.apache.sling.settings Service [org.apache.sling.settings.impl.SlingSettingsServiceImpl,23,
[org.osgi.service.cm.ManagedService]] ServiceEvent REGISTERED
01.04.2018 07:28:29.003 *INFO* [FelixStartLevel] org.apache.sling.settings BundleEvent STARTED
01.04.2018 07:28:29.009 *INFO* [FelixStartLevel] org.apache.aries.util BundleEvent RESOLVED
01.04.2018 07:28:29.009 *INFO* [FelixStartLevel] org.apache.aries.util BundleEvent STARTING
01.04.2018 07:28:29.010 *INFO* [FelixStartLevel] org.apache.aries.util BundleEvent STARTED
01.04.2018 07:28:29.011 *INFO* [FelixStartLevel] org.apache.sling.commons.log BundleEvent
STARTING
01.04.2018 07:28:29.136 *INFO* [FelixStartLevel] org.apache.sling.commons.log Service [org.apache.sling.commons.log.LogManager,24,
[org.osgi.service.cm.ManagedService]] ServiceEvent REGISTERED
01.04.2018 07:28:29.138 *INFO* [FelixStartLevel] org.apache.sling.commons.log Service [org.apache.sling.commons.log.LogManager.factory.writer,25,
[org.osgi.service.cm.ManagedServiceFactory]] ServiceEvent REGISTERED
01.04.2018 07:28:29.138 *INFO* [FelixStartLevel] org.apache.sling.commons.log Service [org.apache.sling.commons.log.LogManager.factory.config,26,
[org.osgi.service.cm.ManagedServiceFactory]] ServiceEvent REGISTERED
01.04.2018 07:28:29.143 *INFO* [FelixStartLevel] org.apache.sling.commons.log Service [Sling
Log Panel Support,27, [org.apache.sling.commons.log.logback.webconsole.LogPanel]] ServiceEvent
REGISTERED
01.04.2018 07:28:29.145 *INFO* [FelixStartLevel] org.apache.sling.commons.log Service [Sling
Log Configuration Printer,28, [org.apache.sling.commons.log.logback.internal.SlingConfigurationPrinter]]
ServiceEvent REGISTERED
01.04.2018 07:28:29.150 *INFO* [FelixStartLevel] org.apache.sling.commons.log Service [Sling
Log Reset Event Handler,29, [org.osgi.service.event.EventHandler]] ServiceEvent REGISTERED
01.04.2018 07:28:29.183 *INFO * [main] Startup completed
01.04.2018 07:28:29.305 *INFO* [OsgiInstallerImpl] org.apache.sling.audit.osgi.installer Installed
configuration org.apache.sling.jcr.base.internal.LoginAdminWhitelist from resource TaskResource(url=launchpad:resources/config/org.apache.sling.jcr.base.internal.LoginAdminWhitelist.config,
entity=config:org.apache.sling.jcr.base.internal.LoginAdminWhitelist, state=INSTALL, attributes=[org.apache.sling.installer.api.tasks.ResourceTransformer=:16:,
service.pid=org.apache.sling.jcr.base.internal.LoginAdminWhitelist], digest=251b8528cdb27078e3831df85db59aea)
01.04.2018 07:28:29.309 *INFO* [OsgiInstallerImpl] org.apache.sling.audit.osgi.installer Installed
configuration org.apache.sling.jcr.base.internal.LoginAdminWhitelist.fragment.cc7e59d2-2931-48d3-9805-143422738201
from resource TaskResource(url=launchpad:resources/config/org.apache.sling.jcr.base.internal.LoginAdminWhitelist.fragment-sling.config,
entity=config:org.apache.sling.jcr.base.internal.LoginAdminWhitelist.fragment.sling, state=INSTALL,
attributes=[org.apache.sling.installer.api.tasks.ResourceTransformer=:16:, service.factoryPid=org.apache.sling.jcr.base.internal.LoginAdminWhitelist.fragment,
service.pid=sling], digest=b57bfd8d9f92019f6166ea7005255d38)
01.04.2018 07:28:29.311 *INFO* [OsgiInstallerImpl] org.apache.sling.audit.osgi.installer Installed
configuration org.apache.sling.jcr.davex.impl.servlets.SlingDavExServlet from resource TaskResource(url=launchpad:resources/config/org.apache.sling.jcr.davex.impl.servlets.SlingDavExServlet.config,
entity=config:org.apache.sling.jcr.davex.impl.servlets.SlingDavExServlet, state=INSTALL, attributes=[org.apache.sling.installer.api.tasks.ResourceTransformer=:16:,
service.pid=org.apache.sling.jcr.davex.impl.servlets.SlingDavExServlet], digest=ee3357fb8cc76c8d77dfa8b61bc29ef3)
01.04.2018 07:28:29.312 *INFO* [OsgiInstallerImpl] org.apache.sling.audit.osgi.installer Installed
configuration org.apache.sling.jcr.repoinit.impl.RepositoryInitializer from resource TaskResource(url=launchpad:resources/config/org.apache.sling.jcr.repoinit.impl.RepositoryInitializer.config,
entity=config:org.apache.sling.jcr.repoinit.impl.RepositoryInitializer, state=INSTALL, attributes=[org.apache.sling.installer.api.tasks.ResourceTransformer=:16:,
service.pid=org.apache.sling.jcr.repoinit.impl.RepositoryInitializer], digest=62590adee787f806d60b246345ae4991)
01.04.2018 07:28:29.314 *INFO* [OsgiInstallerImpl] org.apache.sling.audit.osgi.installer Installed
configuration org.apache.sling.jcr.webdav.impl.servlets.SimpleWebDavServlet from resource
TaskResource(url=launchpad:resources/config/org.apache.sling.jcr.webdav.impl.servlets.SimpleWebDavServlet.config,
entity=config:org.apache.sling.jcr.webdav.impl.servlets.SimpleWebDavServlet, state=INSTALL,
attributes=[org.apache.sling.installer.api.tasks.ResourceTransformer=:16:, service.pid=org.apache.sling.jcr.webdav.impl.servlets.SimpleWebDavServlet],
digest=40b06a2412e7e842f149163de5a9ae75)
01.04.2018 07:28:29.319 *INFO* [OsgiInstallerImpl] org.apache.sling.audit.osgi.installer Installed
configuration org.apache.sling.serviceusermapping.impl.ServiceUserMapperImpl.amended.3dcfbb78-5619-452e-8b35-5a603173b93d
from resource TaskResource(url=launchpad:resources/config/org.apache.sling.serviceusermapping.impl.ServiceUserMapperImpl.amended-i18n.config,
entity=config:org.apache.sling.serviceusermapping.impl.ServiceUserMapperImpl.amended.i18n,
state=INSTALL, attributes=[org.apache.sling.installer.api.tasks.ResourceTransformer=:16:,
service.factoryPid=org.apache.sling.serviceusermapping.impl.ServiceUserMapperImpl.amended,
service.pid=i18n], digest=5ca453becbd0de7378d7d5707823f9a8)
01.04.2018 07:28:29.321 *INFO* [OsgiInstallerImpl] org.apache.sling.audit.osgi.installer Installed
configuration org.apache.sling.serviceusermapping.impl.ServiceUserMapperImpl.amended.fd9e5bbb-71e8-4dea-b417-a0e0f8bc9719
from resource TaskResource(url=launchpad:resources/config/org.apache.sling.serviceusermapping.impl.ServiceUserMapperImpl.amended-jcr-install.config,
entity=config:org.apache.sling.serviceusermapping.impl.ServiceUserMapperImpl.amended.jcr-install,
state=INSTALL, attributes=[org.apache.sling.installer.api.tasks.ResourceTransformer=:16:,
service.factoryPid=org.apache.sling.serviceusermapping.impl.ServiceUserMapperImpl.amended,
service.pid=jcr-install], digest=c54b829f7b7740a799d99e251af020c9)
01.04.2018 07:28:29.324 *INFO* [OsgiInstallerImpl] org.apache.sling.audit.osgi.installer Installed
configuration org.apache.sling.serviceusermapping.impl.ServiceUserMapperImpl.amended.a7f1bd4d-6583-4d62-a31f-0baa9bc44d95
from resource TaskResource(url=launchpad:resources/config/org.apache.sling.serviceusermapping.impl.ServiceUserMapperImpl.amended-jcr-resource.config,
entity=config:org.apache.sling.serviceusermapping.impl.ServiceUserMapperImpl.amended.jcr-resource,
state=INSTALL, attributes=[org.apache.sling.installer.api.tasks.ResourceTransformer=:16:,
service.factoryPid=org.apache.sling.serviceusermapping.impl.ServiceUserMapperImpl.amended,
service.pid=jcr-resource], digest=8b9c2b1535ffb961711fa342f873d589)
01.04.2018 07:28:29.326 *INFO* [OsgiInstallerImpl] org.apache.sling.audit.osgi.installer Installed
configuration org.apache.sling.serviceusermapping.impl.ServiceUserMapperImpl.amended.d5db3de7-7e89-44bc-8198-f63aec2aedea
from resource TaskResource(url=launchpad:resources/config/org.apache.sling.serviceusermapping.impl.ServiceUserMapperImpl.amended-observation.config,
entity=config:org.apache.sling.serviceusermapping.impl.ServiceUserMapperImpl.amended.observation,
state=INSTALL, attributes=[org.apache.sling.installer.api.tasks.ResourceTransformer=:16:,
service.factoryPid=org.apache.sling.serviceusermapping.impl.ServiceUserMapperImpl.amended,
service.pid=observation], digest=b358fca04fc5775b5fee0983520f157b)
Apr 01, 2018 7:28:31 AM org.apache.tika.config.InitializableProblemHandler$3 handleInitializableProblem
WARNING: JBIG2ImageReader not loaded. jbig2 files will be ignored
See https://pdfbox.apache.org/2.0/dependencies.html#jai-image-io
for optional dependencies.
TIFFImageWriter not loaded. tiff files will not be processed
See https://pdfbox.apache.org/2.0/dependencies.html#jai-image-io
for optional dependencies.
J2KImageReader not loaded. JPEG2000 files will not be processed.
See https://pdfbox.apache.org/2.0/dependencies.html#jai-image-io
for optional dependencies.

Apr 01, 2018 7:28:31 AM org.apache.tika.config.InitializableProblemHandler$3 handleInitializableProblem
WARNING: org.xerial's sqlite-jdbc is not loaded.
Please provide the jar on your classpath to parse sqlite files.
See tika-parsers/pom.xml for the correct version.
[INFO] Started Launchpad '_-41000' at port 41000 [run modes: null]
[INFO] 
[INFO] --- maven-failsafe-plugin:2.20.1:integration-test (default) @ org.apache.sling.launchpad.testing
---
[JENKINS] Recording test results
[JENKINS] Archiving disabled
[JENKINS] Archiving disabled
[INFO] ------------------------------------------------------------------------
[INFO] BUILD FAILURE
[INFO] ------------------------------------------------------------------------
[INFO] Total time: 40.568 s
[INFO] Finished at: 2018-04-01T07:28:39+00:00
[INFO] Final Memory: 41M/256M
[INFO] ------------------------------------------------------------------------
Waiting for Jenkins to finish collecting data
Attempting to load ESAPI.properties via file I/O.
Attempting to load ESAPI.properties as resource file via file I/O.
Not found in 'org.owasp.esapi.resources' directory or file not readable: <https://builds.apache.org/job/sling-org-apache-sling-launchpad-testing-10/ws/target/_-41000/ESAPI.properties>
Not found in SystemResource Directory/resourceDirectory: .esapi/ESAPI.properties
Not found in 'user.home' (/home/jenkins) directory: /home/jenkins/esapi/ESAPI.properties
Loading ESAPI.properties via file I/O failed. Exception was: java.io.FileNotFoundException
Attempting to load ESAPI.properties via the classpath.
SUCCESSFULLY LOADED ESAPI.properties via the CLASSPATH from '/ (root)' using class loader
for DefaultSecurityConfiguration class!
Attempting to load validation.properties via file I/O.
Attempting to load validation.properties as resource file via file I/O.
Not found in 'org.owasp.esapi.resources' directory or file not readable: <https://builds.apache.org/job/sling-org-apache-sling-launchpad-testing-10/ws/target/_-41000/validation.properties>
Not found in SystemResource Directory/resourceDirectory: .esapi/validation.properties
Not found in 'user.home' (/home/jenkins) directory: /home/jenkins/esapi/validation.properties
Loading validation.properties via file I/O failed.
Attempting to load validation.properties via the classpath.
SUCCESSFULLY LOADED validation.properties via the CLASSPATH from '/ (root)' using class loader
for DefaultSecurityConfiguration class!
[ERROR] Failed to execute goal org.apache.maven.plugins:maven-failsafe-plugin:2.20.1:integration-test
(default) on project org.apache.sling.launchpad.testing: Execution default of goal org.apache.maven.plugins:maven-failsafe-plugin:2.20.1:integration-test
failed. NullPointerException -> [Help 1]
[ERROR] 
[ERROR] To see the full stack trace of the errors, re-run Maven with the -e switch.
[ERROR] Re-run Maven using the -X switch to enable full debug logging.
[ERROR] 
[ERROR] For more information about the errors and possible solutions, please read the following
articles:
[ERROR] [Help 1] http://cwiki.apache.org/confluence/display/MAVEN/PluginExecutionException
channel stopped
Terminating launchpad _-41000
01.04.2018 07:28:49.536 *INFO * [Apache Sling Terminator] Java VM is shutting down
01.04.2018 07:28:49.538 *INFO * [Apache Sling Terminator] Stopping Apache Sling
Archiving artifacts
01.04.2018 07:28:50.839 *INFO * [Sling Notifier] Apache Sling has been stopped
Recording test results

Mime
View raw message