sling-commits mailing list archives

Site index · List index
Message view « Date » · « Thread »
Top « Date » · « Thread »
From Apache Jenkins Server <jenk...@builds.apache.org>
Subject Build failed in Jenkins: sling-org-apache-sling-launchpad-testing-10 #58
Date Mon, 16 Apr 2018 06:27:38 GMT
See <https://builds.apache.org/job/sling-org-apache-sling-launchpad-testing-10/58/display/redirect>

------------------------------------------
[...truncated 5.56 KB...]
[INFO] Downloaded: http://repository.apache.org/snapshots/org/apache/sling/org.apache.sling.starter/11-SNAPSHOT/maven-metadata.xml
(2 KB at 4.8 KB/sec)
[INFO] Downloading: http://repository.apache.org/snapshots/org/apache/sling/org.apache.sling.starter/11-SNAPSHOT/org.apache.sling.starter-11-20180414.065937-31-slingfeature.txt
[INFO] Downloaded: http://repository.apache.org/snapshots/org/apache/sling/org.apache.sling.starter/11-SNAPSHOT/org.apache.sling.starter-11-20180414.065937-31-slingfeature.txt
(31 KB at 99.0 KB/sec)
[INFO] Downloading: http://repository.apache.org/snapshots/org/apache/sling/org.apache.sling.sample.slingshot/0.8.1-SNAPSHOT/maven-metadata.xml
[INFO] Downloaded: http://repository.apache.org/snapshots/org/apache/sling/org.apache.sling.sample.slingshot/0.8.1-SNAPSHOT/maven-metadata.xml
(2 KB at 4.8 KB/sec)
[INFO] Extended Maven classpath (scope 'provided') by the dependencies extracted from the
Sling model.
[INFO]                                                                         
[INFO] ------------------------------------------------------------------------
[INFO] Building Apache Sling Launchpad Testing 11-SNAPSHOT
[INFO] ------------------------------------------------------------------------
[INFO] Downloading: http://repository.apache.org/snapshots/org/apache/sling/org.apache.sling.launchpad.integration-tests/1.0.7-SNAPSHOT/maven-metadata.xml
[INFO] Downloaded: http://repository.apache.org/snapshots/org/apache/sling/org.apache.sling.launchpad.integration-tests/1.0.7-SNAPSHOT/maven-metadata.xml
(2 KB at 3.4 KB/sec)
[INFO] Downloading: http://repository.apache.org/snapshots/org/apache/sling/org.apache.sling.launchpad.integration-tests/1.0.7-SNAPSHOT/org.apache.sling.launchpad.integration-tests-1.0.7-20180416.062547-42.pom
[INFO] Downloaded: http://repository.apache.org/snapshots/org/apache/sling/org.apache.sling.launchpad.integration-tests/1.0.7-SNAPSHOT/org.apache.sling.launchpad.integration-tests-1.0.7-20180416.062547-42.pom
(12 KB at 40.6 KB/sec)
[INFO] Downloading: http://repository.apache.org/snapshots/org/apache/sling/org.apache.sling.junit.teleporter/1.0.17-SNAPSHOT/maven-metadata.xml
[INFO] Downloaded: http://repository.apache.org/snapshots/org/apache/sling/org.apache.sling.junit.teleporter/1.0.17-SNAPSHOT/maven-metadata.xml
(1021 B at 3.4 KB/sec)
[INFO] Downloading: http://repository.apache.org/snapshots/org/apache/sling/org.apache.sling.junit.teleporter/1.0.17-SNAPSHOT/org.apache.sling.junit.teleporter-1.0.17-20180415.072538-26.pom
[INFO] Downloaded: http://repository.apache.org/snapshots/org/apache/sling/org.apache.sling.junit.teleporter/1.0.17-SNAPSHOT/org.apache.sling.junit.teleporter-1.0.17-20180415.072538-26.pom
(6 KB at 18.4 KB/sec)
[INFO] Downloading: http://repository.apache.org/snapshots/org/apache/sling/org.apache.sling.launchpad.test-services/2.0.15-SNAPSHOT/maven-metadata.xml
[INFO] Downloaded: http://repository.apache.org/snapshots/org/apache/sling/org.apache.sling.launchpad.test-services/2.0.15-SNAPSHOT/maven-metadata.xml
(2 KB at 3.4 KB/sec)
[INFO] Downloading: http://repository.apache.org/snapshots/org/apache/sling/org.apache.sling.launchpad.test-services/2.0.15-SNAPSHOT/org.apache.sling.launchpad.test-services-2.0.15-20180416.062436-15.pom
[INFO] Downloaded: http://repository.apache.org/snapshots/org/apache/sling/org.apache.sling.launchpad.test-services/2.0.15-SNAPSHOT/org.apache.sling.launchpad.test-services-2.0.15-20180416.062436-15.pom
(10 KB at 34.0 KB/sec)
[INFO] Downloading: http://repository.apache.org/snapshots/org/apache/sling/org.apache.sling.launchpad.test-bundles/0.0.5-SNAPSHOT/org.apache.sling.launchpad.test-bundles-0.0.5-20180410.224937-17.pom
[INFO] Downloaded: http://repository.apache.org/snapshots/org/apache/sling/org.apache.sling.launchpad.test-bundles/0.0.5-SNAPSHOT/org.apache.sling.launchpad.test-bundles-0.0.5-20180410.224937-17.pom
(3 KB at 7.6 KB/sec)
[INFO] Downloading: http://repository.apache.org/snapshots/org/apache/sling/org.apache.sling.starter/11-SNAPSHOT/org.apache.sling.starter-11-20180414.065937-31.pom
[INFO] Downloaded: http://repository.apache.org/snapshots/org/apache/sling/org.apache.sling.starter/11-SNAPSHOT/org.apache.sling.starter-11-20180414.065937-31.pom
(8 KB at 24.6 KB/sec)
[INFO] Downloading: http://repository.apache.org/snapshots/org/apache/sling/org.apache.sling.launchpad.test-fragment/2.0.15-SNAPSHOT/maven-metadata.xml
[INFO] Downloaded: http://repository.apache.org/snapshots/org/apache/sling/org.apache.sling.launchpad.test-fragment/2.0.15-SNAPSHOT/maven-metadata.xml
(2 KB at 3.4 KB/sec)
[INFO] Downloading: http://repository.apache.org/snapshots/org/apache/sling/org.apache.sling.launchpad.test-services-war/2.0.15-SNAPSHOT/maven-metadata.xml
[INFO] Downloaded: http://repository.apache.org/snapshots/org/apache/sling/org.apache.sling.launchpad.test-services-war/2.0.15-SNAPSHOT/maven-metadata.xml
(2 KB at 3.4 KB/sec)
[INFO] Downloading: http://repository.apache.org/snapshots/org/apache/sling/org.apache.sling.launchpad.test-services-war/2.0.15-SNAPSHOT/org.apache.sling.launchpad.test-services-war-2.0.15-20180412.225437-12.pom
[INFO] Downloaded: http://repository.apache.org/snapshots/org/apache/sling/org.apache.sling.launchpad.test-services-war/2.0.15-SNAPSHOT/org.apache.sling.launchpad.test-services-war-2.0.15-20180412.225437-12.pom
(6 KB at 19.7 KB/sec)
[INFO] Downloading: http://repository.apache.org/snapshots/org/apache/sling/org.apache.sling.auth.form/1.0.9-SNAPSHOT/maven-metadata.xml
[INFO] Downloaded: http://repository.apache.org/snapshots/org/apache/sling/org.apache.sling.auth.form/1.0.9-SNAPSHOT/maven-metadata.xml
(1018 B at 3.3 KB/sec)
[INFO] Downloading: http://repository.apache.org/snapshots/org/apache/sling/org.apache.sling.starter.content/1.0.0-SNAPSHOT/maven-metadata.xml
[INFO] Downloaded: http://repository.apache.org/snapshots/org/apache/sling/org.apache.sling.starter.content/1.0.0-SNAPSHOT/maven-metadata.xml
(1016 B at 3.3 KB/sec)
[INFO] Downloading: http://repository.apache.org/snapshots/org/apache/sling/org.apache.sling.starter.content/1.0.0-SNAPSHOT/org.apache.sling.starter.content-1.0.0-20180413.213026-13.pom
[INFO] Downloaded: http://repository.apache.org/snapshots/org/apache/sling/org.apache.sling.starter.content/1.0.0-SNAPSHOT/org.apache.sling.starter.content-1.0.0-20180413.213026-13.pom
(5 KB at 15.4 KB/sec)
[INFO] Downloading: http://repository.apache.org/snapshots/org/apache/sling/org.apache.sling.launchpad.integration-tests/1.0.7-SNAPSHOT/org.apache.sling.launchpad.integration-tests-1.0.7-20180416.062547-42.jar
[INFO] Downloading: http://repository.apache.org/snapshots/org/apache/sling/org.apache.sling.junit.teleporter/1.0.17-SNAPSHOT/org.apache.sling.junit.teleporter-1.0.17-20180415.072538-26.jar
[INFO] Downloading: http://repository.apache.org/snapshots/org/apache/sling/org.apache.sling.launchpad.test-services-war/2.0.15-SNAPSHOT/org.apache.sling.launchpad.test-services-war-2.0.15-20180412.225437-12.war
[INFO] Downloading: http://repository.apache.org/snapshots/org/apache/sling/org.apache.sling.launchpad.test-services/2.0.15-SNAPSHOT/org.apache.sling.launchpad.test-services-2.0.15-20180416.062436-15.jar
[INFO] Downloading: http://repository.apache.org/snapshots/org/apache/sling/org.apache.sling.starter.content/1.0.0-SNAPSHOT/org.apache.sling.starter.content-1.0.0-20180413.213026-13.jar
[INFO] Downloaded: http://repository.apache.org/snapshots/org/apache/sling/org.apache.sling.launchpad.test-services-war/2.0.15-SNAPSHOT/org.apache.sling.launchpad.test-services-war-2.0.15-20180412.225437-12.war
(14 KB at 46.9 KB/sec)
[INFO] Downloaded: http://repository.apache.org/snapshots/org/apache/sling/org.apache.sling.junit.teleporter/1.0.17-SNAPSHOT/org.apache.sling.junit.teleporter-1.0.17-20180415.072538-26.jar
(37 KB at 101.8 KB/sec)
[INFO] Downloaded: http://repository.apache.org/snapshots/org/apache/sling/org.apache.sling.launchpad.test-services/2.0.15-SNAPSHOT/org.apache.sling.launchpad.test-services-2.0.15-20180416.062436-15.jar
(202 KB at 401.3 KB/sec)
[INFO] Downloaded: http://repository.apache.org/snapshots/org/apache/sling/org.apache.sling.starter.content/1.0.0-SNAPSHOT/org.apache.sling.starter.content-1.0.0-20180413.213026-13.jar
(145 KB at 286.6 KB/sec)
[INFO] Downloaded: http://repository.apache.org/snapshots/org/apache/sling/org.apache.sling.launchpad.integration-tests/1.0.7-SNAPSHOT/org.apache.sling.launchpad.integration-tests-1.0.7-20180416.062547-42.jar
(485 KB at 744.7 KB/sec)
[INFO] 
[INFO] --- maven-clean-plugin:3.0.0:clean (default-clean) @ org.apache.sling.launchpad.testing
---
[INFO] 
[INFO] --- maven-enforcer-plugin:3.0.0-M1:enforce (enforce-property-values) @ org.apache.sling.launchpad.testing
---
[INFO] 
[INFO] --- maven-enforcer-plugin:3.0.0-M1:enforce (enforce-java) @ org.apache.sling.launchpad.testing
---
[INFO] 
[INFO] --- maven-enforcer-plugin:3.0.0-M1:enforce (ban-maven-scr-plugin) @ org.apache.sling.launchpad.testing
---
[INFO] 
[INFO] --- maven-remote-resources-plugin:1.5:process (process-resource-bundles) @ org.apache.sling.launchpad.testing
---
[INFO] 
[INFO] --- maven-remote-resources-plugin:1.5:process (default) @ org.apache.sling.launchpad.testing
---
[INFO] 
[INFO] --- maven-resources-plugin:2.7:resources (default-resources) @ org.apache.sling.launchpad.testing
---
[INFO] Using 'UTF-8' encoding to copy filtered resources.
[INFO] skip non existing resourceDirectory <https://builds.apache.org/job/sling-org-apache-sling-launchpad-testing-10/ws/src/main/resources>
[INFO] Copying 3 resources
[INFO] Copying 3 resources
[INFO] 
[INFO] --- build-helper-maven-plugin:3.0.0:reserve-network-port (reserve-network-port) @ org.apache.sling.launchpad.testing
---
[INFO] Port assigned41000
[INFO] Reserved port 41000 for http.port
[INFO] Port assigned41001
[INFO] Reserved port 41001 for sling.control.port
[INFO] 
[INFO] --- maven-compiler-plugin:3.7.0:compile (default-compile) @ org.apache.sling.launchpad.testing
---
[INFO] No sources to compile
[INFO] 
[INFO] --- maven-resources-plugin:2.7:testResources (default-testResources) @ org.apache.sling.launchpad.testing
---
[INFO] Using 'UTF-8' encoding to copy filtered resources.
[INFO] Copying 1 resource
[INFO] Copying 3 resources
[INFO] Copying 3 resources
[INFO] 
[INFO] --- maven-compiler-plugin:3.7.0:testCompile (default-testCompile) @ org.apache.sling.launchpad.testing
---
[INFO] No sources to compile
[INFO] 
[INFO] --- maven-surefire-plugin:2.20.1:test (default-test) @ org.apache.sling.launchpad.testing
---
[JENKINS] Recording test results
[INFO] 
[INFO] --- slingstart-maven-plugin:1.7.16:prepare-package (default-prepare-package) @ org.apache.sling.launchpad.testing
---
[INFO] 
[INFO] --- slingstart-maven-plugin:1.7.16:attach-slingfeature (default-attach-slingfeature)
@ org.apache.sling.launchpad.testing ---
[INFO] 
[INFO] --- slingstart-maven-plugin:1.7.16:package (default-package) @ org.apache.sling.launchpad.testing
---
[INFO] Packaging standalone jar...
[INFO] Building zip: <https://builds.apache.org/job/sling-org-apache-sling-launchpad-testing-10/ws/target/org.apache.sling.launchpad.testing-11-SNAPSHOT.jar>
[INFO] 
[INFO] >>> maven-source-plugin:3.0.1:jar (attach-sources) > generate-sources @
org.apache.sling.launchpad.testing >>>
[INFO] 
[INFO] --- maven-enforcer-plugin:3.0.0-M1:enforce (enforce-property-values) @ org.apache.sling.launchpad.testing
---
[INFO] 
[INFO] --- maven-enforcer-plugin:3.0.0-M1:enforce (enforce-java) @ org.apache.sling.launchpad.testing
---
[INFO] 
[INFO] --- maven-enforcer-plugin:3.0.0-M1:enforce (ban-maven-scr-plugin) @ org.apache.sling.launchpad.testing
---
[WARNING] Failed to getClass for org.apache.maven.plugins.source.SourceJarMojo
[INFO] 
[INFO] <<< maven-source-plugin:3.0.1:jar (attach-sources) < generate-sources @
org.apache.sling.launchpad.testing <<<
[INFO] 
[INFO] --- maven-source-plugin:3.0.1:jar (attach-sources) @ org.apache.sling.launchpad.testing
---
[INFO] Building jar: <https://builds.apache.org/job/sling-org-apache-sling-launchpad-testing-10/ws/target/org.apache.sling.launchpad.testing-11-SNAPSHOT-sources.jar>
[INFO] 
[INFO] --- maven-site-plugin:3.5.1:attach-descriptor (attach-descriptor) @ org.apache.sling.launchpad.testing
---
[INFO] 
[INFO] --- slingstart-maven-plugin:1.7.16:start (start-container) @ org.apache.sling.launchpad.testing
---
[INFO] Using launchpad jar being generated as this project's primary artifact: '<https://builds.apache.org/job/sling-org-apache-sling-launchpad-testing-10/ws/target/org.apache.sling.launchpad.testing-11-SNAPSHOT.jar'!>
[INFO] Starting Launchpad _-41000...
-------------------------------------------------------------------
Slingstart application: <https://builds.apache.org/job/sling-org-apache-sling-launchpad-testing-10/ws/target/_-41000/org.apache.sling.launchpad.testing-11-SNAPSHOT.jar>
Main class: org.apache.sling.launchpad.app.Main
Listener Port: 41653
Arguments: [-p, 41000, -j, 41001]
-------------------------------------------------------------------
16.04.2018 06:27:21.059 *INFO * [main] Setting sling.home=sling (default)
16.04.2018 06:27:21.062 *INFO * [main] Starting Apache Sling in <https://builds.apache.org/job/sling-org-apache-sling-launchpad-testing-10/ws/target/_-41000/sling>
16.04.2018 06:27:21.065 *INFO * [main] Sling  Extension Lib Home : <https://builds.apache.org/job/sling-org-apache-sling-launchpad-testing-10/ws/target/_-41000/sling/ext>
16.04.2018 06:27:21.066 *INFO * [main] Checking launcher JAR in folder <https://builds.apache.org/job/sling-org-apache-sling-launchpad-testing-10/ws/target/_-41000/sling>
16.04.2018 06:27:21.080 *INFO * [main] Installing new launcher: jar:<https://builds.apache.org/job/sling-org-apache-sling-launchpad-testing-10/ws/target/_-41000/org.apache.sling.launchpad.testing-11-SNAPSHOT.jar!/resources/org.apache.sling.launchpad.base.jar,>
5.6.10.2_6_26 (org.apache.sling.launchpad.base.jar.1523860041080)
16.04.2018 06:27:21.082 *INFO * [main] Loading launcher class org.apache.sling.launchpad.base.app.MainDelegate
from org.apache.sling.launchpad.base.jar.1523860041080
16.04.2018 06:27:21.082 *INFO * [main] External Libs Home (ext) is null or does not exists.
16.04.2018 06:27:21.097 *INFO * [main] Setting sling.launchpad=<https://builds.apache.org/job/sling-org-apache-sling-launchpad-testing-10/ws/target/_-41000/sling>
16.04.2018 06:27:21.097 *INFO * [main] Setting org.osgi.service.http.port=41000
16.04.2018 06:27:21.097 *INFO * [main] Setting sling.control.socket=41001
16.04.2018 06:27:21.097 *INFO * [main] Starting launcher ...
16.04.2018 06:27:21.107 *INFO * [main] HTTP server port: 41000
WARNING: An illegal reflective access operation has occurred
WARNING: Illegal reflective access by org.apache.felix.framework.ext.ClassPathExtenderFactory$DefaultClassLoaderExtender
(<https://builds.apache.org/job/sling-org-apache-sling-launchpad-testing-10/ws/target/_-41000/sling/org.apache.sling.launchpad.base.jar.1523860041080)>
to method java.net.URLClassLoader.addURL(java.net.URL)
WARNING: Please consider reporting this to the maintainers of org.apache.felix.framework.ext.ClassPathExtenderFactory$DefaultClassLoaderExtender
WARNING: Use --illegal-access=warn to enable warnings of further illegal reflective access
operations
WARNING: All illegal access operations will be denied in a future release
16.04.2018 06:27:21.907 *INFO* [OsgiInstallerImpl] org.apache.sling.installer.core.impl.OsgiInstallerImpl
Apache Sling OSGi Installer Service started.
16.04.2018 06:27:21.940 *INFO* [FelixStartLevel] org.apache.sling.commons.logservice Service
[org.apache.sling.commons.logservice.internal.LogServiceFactory,14, [org.osgi.service.log.LogService]]
ServiceEvent REGISTERED
16.04.2018 06:27:21.943 *INFO* [FelixStartLevel] org.apache.sling.commons.logservice Service
[org.apache.sling.commons.logservice.internal.LogReaderServiceFactory,15, [org.osgi.service.log.LogReaderService]]
ServiceEvent REGISTERED
16.04.2018 06:27:21.946 *INFO* [FelixStartLevel] org.apache.sling.commons.logservice BundleEvent
STARTED
16.04.2018 06:27:21.954 *INFO* [FelixStartLevel] org.apache.sling.javax.activation BundleEvent
RESOLVED
16.04.2018 06:27:21.962 *INFO* [FelixStartLevel] org.apache.sling.javax.activation BundleEvent
STARTING
16.04.2018 06:27:21.968 *INFO* [FelixStartLevel] org.apache.sling.javax.activation BundleEvent
STARTED
16.04.2018 06:27:21.974 *INFO* [FelixStartLevel] org.apache.sling.installer.factory.configuration
BundleEvent RESOLVED
16.04.2018 06:27:21.976 *INFO* [FelixStartLevel] org.apache.sling.installer.factory.configuration
BundleEvent STARTING
16.04.2018 06:27:21.978 *INFO* [FelixStartLevel] org.apache.sling.installer.factory.configuration
BundleEvent STARTED
16.04.2018 06:27:21.985 *INFO* [FelixStartLevel] org.apache.sling.launchpad.installer BundleEvent
RESOLVED
16.04.2018 06:27:21.985 *INFO* [FelixStartLevel] org.apache.sling.settings BundleEvent RESOLVED
16.04.2018 06:27:21.988 *INFO* [FelixStartLevel] org.apache.sling.launchpad.installer BundleEvent
STARTING
16.04.2018 06:27:21.992 *INFO* [FelixStartLevel] org.apache.sling.launchpad.installer BundleEvent
STARTED
16.04.2018 06:27:21.996 *INFO* [FelixStartLevel] log4j.over.slf4j BundleEvent RESOLVED
16.04.2018 06:27:21.997 *INFO* [FelixStartLevel] log4j.over.slf4j BundleEvent STARTING
16.04.2018 06:27:21.997 *INFO* [FelixStartLevel] log4j.over.slf4j BundleEvent STARTED
16.04.2018 06:27:22.002 *INFO* [FelixStartLevel] org.apache.felix.configadmin BundleEvent
STARTING
16.04.2018 06:27:22.011 *INFO* [FelixStartLevel] org.apache.felix.configadmin Service [org.apache.felix.cm.file.FilePersistenceManager,16,
[org.apache.felix.cm.PersistenceManager]] ServiceEvent REGISTERED
16.04.2018 06:27:22.013 *INFO* [FelixStartLevel] org.apache.felix.configadmin Service [org.apache.felix.cm.ConfigurationAdmin,17,
[org.osgi.service.cm.ConfigurationAdmin]] ServiceEvent REGISTERED
16.04.2018 06:27:22.018 *INFO* [FelixStartLevel] org.apache.sling.installer.factory.configuration
Service [Apache Sling Configuration Install Task Factory,18, [org.apache.sling.installer.api.tasks.InstallTaskFactory,
org.osgi.service.cm.ConfigurationListener, org.apache.sling.installer.api.tasks.ResourceTransformer]]
ServiceEvent REGISTERED
16.04.2018 06:27:22.024 *INFO* [FelixStartLevel] org.apache.felix.configadmin BundleEvent
STARTED
16.04.2018 06:27:22.025 *INFO* [FelixStartLevel] slf4j.api BundleEvent STARTING
16.04.2018 06:27:22.025 *INFO* [FelixStartLevel] slf4j.api BundleEvent STARTED
16.04.2018 06:27:22.029 *INFO* [FelixStartLevel] org.apache.geronimo.specs.geronimo-atinject_1.0_spec
BundleEvent RESOLVED
16.04.2018 06:27:22.029 *INFO* [FelixStartLevel] org.apache.geronimo.specs.geronimo-atinject_1.0_spec
BundleEvent STARTING
16.04.2018 06:27:22.029 *INFO* [FelixStartLevel] org.apache.geronimo.specs.geronimo-atinject_1.0_spec
BundleEvent STARTED
16.04.2018 06:27:22.035 *INFO* [FelixStartLevel] org.apache.aries.util BundleEvent RESOLVED
16.04.2018 06:27:22.035 *INFO* [FelixStartLevel] org.apache.aries.util BundleEvent STARTING
16.04.2018 06:27:22.035 *INFO* [FelixStartLevel] org.apache.aries.util BundleEvent STARTED
16.04.2018 06:27:22.038 *INFO* [FelixStartLevel] org.apache.sling.installer.provider.file
BundleEvent RESOLVED
16.04.2018 06:27:22.040 *INFO* [FelixStartLevel] org.apache.sling.installer.provider.file
BundleEvent STARTING
16.04.2018 06:27:22.043 *INFO* [FelixStartLevel] org.apache.sling.installer.provider.file
BundleEvent STARTED
16.04.2018 06:27:22.044 *INFO* [FelixStartLevel] org.apache.sling.commons.log BundleEvent
STARTING
16.04.2018 06:27:22.065 *INFO* [FelixStartLevel] org.apache.sling.commons.log Service [org.apache.sling.commons.log.LogManager,19,
[org.osgi.service.cm.ManagedService]] ServiceEvent REGISTERED
16.04.2018 06:27:22.067 *INFO* [FelixStartLevel] org.apache.sling.commons.log Service [org.apache.sling.commons.log.LogManager.factory.writer,20,
[org.osgi.service.cm.ManagedServiceFactory]] ServiceEvent REGISTERED
16.04.2018 06:27:22.068 *INFO* [FelixStartLevel] org.apache.sling.commons.log Service [org.apache.sling.commons.log.LogManager.factory.config,21,
[org.osgi.service.cm.ManagedServiceFactory]] ServiceEvent REGISTERED
16.04.2018 06:27:22.072 *INFO* [FelixStartLevel] org.apache.sling.commons.log Service [Sling
Log Panel Support,22, [org.apache.sling.commons.log.logback.webconsole.LogPanel]] ServiceEvent
REGISTERED
16.04.2018 06:27:22.073 *INFO* [FelixStartLevel] org.apache.sling.commons.log Service [Sling
Log Configuration Printer,23, [org.apache.sling.commons.log.logback.internal.SlingConfigurationPrinter]]
ServiceEvent REGISTERED
16.04.2018 06:27:22.074 *INFO* [FelixStartLevel] org.apache.sling.commons.log Service [Sling
Log Reset Event Handler,24, [org.osgi.service.event.EventHandler]] ServiceEvent REGISTERED
16.04.2018 06:27:22.390 *INFO * [main] Startup completed
16.04.2018 06:27:22.575 *INFO* [OsgiInstallerImpl] org.apache.sling.audit.osgi.installer Installed
configuration org.apache.sling.jcr.davex.impl.servlets.SlingDavExServlet from resource TaskResource(url=launchpad:resources/config/org.apache.sling.jcr.davex.impl.servlets.SlingDavExServlet.config,
entity=config:org.apache.sling.jcr.davex.impl.servlets.SlingDavExServlet, state=INSTALL, attributes=[org.apache.sling.installer.api.tasks.ResourceTransformer=:18:,
service.pid=org.apache.sling.jcr.davex.impl.servlets.SlingDavExServlet], digest=ee3357fb8cc76c8d77dfa8b61bc29ef3)
16.04.2018 06:27:22.576 *INFO* [OsgiInstallerImpl] org.apache.sling.audit.osgi.installer Installed
configuration org.apache.sling.jcr.repoinit.impl.RepositoryInitializer from resource TaskResource(url=launchpad:resources/config/org.apache.sling.jcr.repoinit.impl.RepositoryInitializer.config,
entity=config:org.apache.sling.jcr.repoinit.impl.RepositoryInitializer, state=INSTALL, attributes=[org.apache.sling.installer.api.tasks.ResourceTransformer=:18:,
service.pid=org.apache.sling.jcr.repoinit.impl.RepositoryInitializer], digest=62590adee787f806d60b246345ae4991)
16.04.2018 06:27:22.578 *INFO* [OsgiInstallerImpl] org.apache.sling.audit.osgi.installer Installed
configuration org.apache.sling.jcr.webdav.impl.servlets.SimpleWebDavServlet from resource
TaskResource(url=launchpad:resources/config/org.apache.sling.jcr.webdav.impl.servlets.SimpleWebDavServlet.config,
entity=config:org.apache.sling.jcr.webdav.impl.servlets.SimpleWebDavServlet, state=INSTALL,
attributes=[org.apache.sling.installer.api.tasks.ResourceTransformer=:18:, service.pid=org.apache.sling.jcr.webdav.impl.servlets.SimpleWebDavServlet],
digest=40b06a2412e7e842f149163de5a9ae75)
16.04.2018 06:27:22.580 *INFO* [OsgiInstallerImpl] org.apache.sling.audit.osgi.installer Installed
configuration org.apache.sling.scripting.core.impl.ScriptCacheImpl from resource TaskResource(url=launchpad:resources/config/org.apache.sling.scripting.core.impl.ScriptCacheImpl.config,
entity=config:org.apache.sling.scripting.core.impl.ScriptCacheImpl, state=INSTALL, attributes=[org.apache.sling.installer.api.tasks.ResourceTransformer=:18:,
service.pid=org.apache.sling.scripting.core.impl.ScriptCacheImpl], digest=13b57519a048a6c8873ed61949d013f6)
16.04.2018 06:27:22.582 *INFO* [OsgiInstallerImpl] org.apache.sling.audit.osgi.installer Installed
configuration org.apache.sling.serviceusermapping.impl.ServiceUserMapperImpl.amended.f24be34d-000c-4e92-a2cb-d4eef1b4708f
from resource TaskResource(url=launchpad:resources/config/org.apache.sling.serviceusermapping.impl.ServiceUserMapperImpl.amended-i18n.config,
entity=config:org.apache.sling.serviceusermapping.impl.ServiceUserMapperImpl.amended.i18n,
state=INSTALL, attributes=[org.apache.sling.installer.api.tasks.ResourceTransformer=:18:,
service.factoryPid=org.apache.sling.serviceusermapping.impl.ServiceUserMapperImpl.amended,
service.pid=i18n], digest=5ca453becbd0de7378d7d5707823f9a8)
16.04.2018 06:27:22.584 *INFO* [OsgiInstallerImpl] org.apache.sling.audit.osgi.installer Installed
configuration org.apache.sling.serviceusermapping.impl.ServiceUserMapperImpl.amended.3d2994eb-481b-4e4f-8844-231b5f3b5d94
from resource TaskResource(url=launchpad:resources/config/org.apache.sling.serviceusermapping.impl.ServiceUserMapperImpl.amended-jcr-install.config,
entity=config:org.apache.sling.serviceusermapping.impl.ServiceUserMapperImpl.amended.jcr-install,
state=INSTALL, attributes=[org.apache.sling.installer.api.tasks.ResourceTransformer=:18:,
service.factoryPid=org.apache.sling.serviceusermapping.impl.ServiceUserMapperImpl.amended,
service.pid=jcr-install], digest=c54b829f7b7740a799d99e251af020c9)
16.04.2018 06:27:22.586 *INFO* [OsgiInstallerImpl] org.apache.sling.audit.osgi.installer Installed
configuration org.apache.sling.serviceusermapping.impl.ServiceUserMapperImpl.amended.6e26c99c-8e02-4ae9-9783-ed32fafc0bd3
from resource TaskResource(url=launchpad:resources/config/org.apache.sling.serviceusermapping.impl.ServiceUserMapperImpl.amended-jcr-resource.config,
entity=config:org.apache.sling.serviceusermapping.impl.ServiceUserMapperImpl.amended.jcr-resource,
state=INSTALL, attributes=[org.apache.sling.installer.api.tasks.ResourceTransformer=:18:,
service.factoryPid=org.apache.sling.serviceusermapping.impl.ServiceUserMapperImpl.amended,
service.pid=jcr-resource], digest=8b9c2b1535ffb961711fa342f873d589)
16.04.2018 06:27:22.590 *INFO* [OsgiInstallerImpl] org.apache.sling.audit.osgi.installer Installed
configuration org.apache.sling.serviceusermapping.impl.ServiceUserMapperImpl.amended.bb4f2015-2cc2-417d-9d18-d3b02006db31
from resource TaskResource(url=launchpad:resources/config/org.apache.sling.serviceusermapping.impl.ServiceUserMapperImpl.amended-resourceresolver.config,
entity=config:org.apache.sling.serviceusermapping.impl.ServiceUserMapperImpl.amended.resourceresolver,
state=INSTALL, attributes=[org.apache.sling.installer.api.tasks.ResourceTransformer=:18:,
service.factoryPid=org.apache.sling.serviceusermapping.impl.ServiceUserMapperImpl.amended,
service.pid=resourceresolver], digest=d317bcbc20315e21bdbb0480199d7a55)
16.04.2018 06:27:22.593 *INFO* [OsgiInstallerImpl] org.apache.sling.audit.osgi.installer Installed
configuration org.apache.sling.serviceusermapping.impl.ServiceUserMapperImpl.amended.11727a06-9386-4240-bb85-a7c4792acf10
from resource TaskResource(url=launchpad:resources/config/org.apache.sling.serviceusermapping.impl.ServiceUserMapperImpl.amended-scripting.config,
entity=config:org.apache.sling.serviceusermapping.impl.ServiceUserMapperImpl.amended.scripting,
state=INSTALL, attributes=[org.apache.sling.installer.api.tasks.ResourceTransformer=:18:,
service.factoryPid=org.apache.sling.serviceusermapping.impl.ServiceUserMapperImpl.amended,
service.pid=scripting], digest=479bf62d1c800aa03dba13706319afd1)
16.04.2018 06:27:22.596 *INFO* [OsgiInstallerImpl] org.apache.sling.audit.osgi.installer Installed
configuration org.apache.sling.serviceusermapping.impl.ServiceUserMapperImpl.amended.0cc890a7-415e-4b49-a4f8-66a06c4192f1
from resource TaskResource(url=launchpad:resources/config/org.apache.sling.serviceusermapping.impl.ServiceUserMapperImpl.amended-servletsresolver.config,
entity=config:org.apache.sling.serviceusermapping.impl.ServiceUserMapperImpl.amended.servletsresolver,
state=INSTALL, attributes=[org.apache.sling.installer.api.tasks.ResourceTransformer=:18:,
service.factoryPid=org.apache.sling.serviceusermapping.impl.ServiceUserMapperImpl.amended,
service.pid=servletsresolver], digest=36b119a784d011be61d06b5de31d4753)
16.04.2018 06:27:22.627 *INFO* [OsgiInstallerImpl] org.apache.sling.audit.osgi.installer Installed
configuration org.apache.sling.serviceusermapping.impl.ServiceUserMapperImpl.amended.9599f282-3d29-4334-ad14-a21723f0dbec
from resource TaskResource(url=launchpad:resources/config/org.apache.sling.serviceusermapping.impl.ServiceUserMapperImpl.amended-sling-caconfig.config,
entity=config:org.apache.sling.serviceusermapping.impl.ServiceUserMapperImpl.amended.sling-caconfig,
state=INSTALL, attributes=[org.apache.sling.installer.api.tasks.ResourceTransformer=:18:,
service.factoryPid=org.apache.sling.serviceusermapping.impl.ServiceUserMapperImpl.amended,
service.pid=sling-caconfig], digest=f21cac1a9c2ba6661442ce589b9242f3)
Apr 16, 2018 6:27:24 AM org.apache.tika.config.InitializableProblemHandler$3 handleInitializableProblem
WARNING: JBIG2ImageReader not loaded. jbig2 files will be ignored
See https://pdfbox.apache.org/2.0/dependencies.html#jai-image-io
for optional dependencies.
TIFFImageWriter not loaded. tiff files will not be processed
See https://pdfbox.apache.org/2.0/dependencies.html#jai-image-io
for optional dependencies.
J2KImageReader not loaded. JPEG2000 files will not be processed.
See https://pdfbox.apache.org/2.0/dependencies.html#jai-image-io
for optional dependencies.

Apr 16, 2018 6:27:24 AM org.apache.tika.config.InitializableProblemHandler$3 handleInitializableProblem
WARNING: org.xerial's sqlite-jdbc is not loaded.
Please provide the jar on your classpath to parse sqlite files.
See tika-parsers/pom.xml for the correct version.
[INFO] Started Launchpad '_-41000' at port 41000 [run modes: null]
[INFO] 
[INFO] --- maven-failsafe-plugin:2.20.1:integration-test (default) @ org.apache.sling.launchpad.testing
---
[JENKINS] Recording test results
[JENKINS] Archiving disabled
[JENKINS] Archiving disabled
[INFO] ------------------------------------------------------------------------
[INFO] BUILD FAILURE
[INFO] ------------------------------------------------------------------------
[INFO] Total time: 45.586 s
[INFO] Finished at: 2018-04-16T06:27:32+00:00
[INFO] Final Memory: 41M/256M
[INFO] ------------------------------------------------------------------------
Waiting for Jenkins to finish collecting data
[ERROR] Failed to execute goal org.apache.maven.plugins:maven-failsafe-plugin:2.20.1:integration-test
(default) on project org.apache.sling.launchpad.testing: Execution default of goal org.apache.maven.plugins:maven-failsafe-plugin:2.20.1:integration-test
failed. NullPointerException -> [Help 1]
[ERROR] 
[ERROR] To see the full stack trace of the errors, re-run Maven with the -e switch.
[ERROR] Re-run Maven using the -X switch to enable full debug logging.
[ERROR] 
[ERROR] For more information about the errors and possible solutions, please read the following
articles:
[ERROR] [Help 1] http://cwiki.apache.org/confluence/display/MAVEN/PluginExecutionException
channel stopped
Terminating launchpad _-41000
16.04.2018 06:27:35.909 *INFO * [Apache Sling Terminator] Java VM is shutting down
16.04.2018 06:27:35.910 *INFO * [Apache Sling Terminator] Stopping Apache Sling
Archiving artifacts
16.04.2018 06:27:37.188 *INFO * [Sling Notifier] Apache Sling has been stopped
ERROR: Failed to archive {target/_-41000/sling/logs/request.log=target/_-41000/sling/logs/request.log,
target/_-41000/sling/logs/access.log=target/_-41000/sling/logs/access.log, target/_-41000/sling/logs/error.log=target/_-41000/sling/logs/error.log}
due to internal error; falling back to full archiving
java.lang.IllegalStateException: checksum mismatch after transfer (3546072541169594928 vs.
3545152013); /x1/jenkins/jenkins-home/jobs/sling-org-apache-sling-launchpad-testing-10/builds/58/archive/target/_-41000/sling/logs/error.log
may be corrupted
	at jsync.protocol.FileSequenceReader.read(FileSequenceReader.java:45)
	at com.cloudbees.jenkins.plugins.jsync.archiver.JSyncArtifactManager.remoteSync(JSyncArtifactManager.java:158)
	at com.cloudbees.jenkins.plugins.jsync.archiver.JSyncArtifactManager.archive(JSyncArtifactManager.java:76)
	at hudson.tasks.ArtifactArchiver.perform(ArtifactArchiver.java:245)
	at hudson.tasks.BuildStepCompatibilityLayer.perform(BuildStepCompatibilityLayer.java:81)
	at hudson.tasks.BuildStepMonitor$1.perform(BuildStepMonitor.java:20)
	at hudson.model.AbstractBuild$AbstractBuildExecution.perform(AbstractBuild.java:744)
	at hudson.model.AbstractBuild$AbstractBuildExecution.performAllBuildSteps(AbstractBuild.java:690)
	at hudson.maven.MavenModuleSetBuild$MavenModuleSetBuildExecution.post2(MavenModuleSetBuild.java:1073)
	at hudson.model.AbstractBuild$AbstractBuildExecution.post(AbstractBuild.java:635)
	at hudson.model.Run.execute(Run.java:1749)
	at hudson.maven.MavenModuleSetBuild.run(MavenModuleSetBuild.java:543)
	at hudson.model.ResourceController.execute(ResourceController.java:97)
	at hudson.model.Executor.run(Executor.java:429)
Recording test results

Mime
View raw message