sling-commits mailing list archives

Site index · List index
Message view « Date » · « Thread »
Top « Date » · « Thread »
From Apache Jenkins Server <>
Subject Build failed in Jenkins: sling-org-apache-sling-commons-cache-portal-1.8 #41
Date Mon, 02 Apr 2018 08:45:21 GMT
See <>

Started by upstream project "sling-org-apache-sling-commons-cache-api-1.8" build number 22
originally caused by:
 Started by timer
[EnvInject] - Loading node environment variables.
Building remotely on H23 (ubuntu xenial) in workspace <>
 > git rev-parse --is-inside-work-tree # timeout=10
Fetching changes from the remote Git repository
 > git config remote.origin.url
# timeout=10
Fetching upstream changes from
 > git --version # timeout=10
 > git fetch --tags --progress
 > git rev-parse origin/master^{commit} # timeout=10
Checking out Revision 089669d5985d5bec28f306e3a048b32fc1b5c601 (origin/master)
 > git config core.sparsecheckout # timeout=10
 > git checkout -f 089669d5985d5bec28f306e3a048b32fc1b5c601
Commit message: "SLING-7213 - Add a default .gitignore file to every module"
 > git rev-list --no-walk 089669d5985d5bec28f306e3a048b32fc1b5c601 # timeout=10
Parsing POMs
Established TCP socket on 45872
maven33-agent.jar already up to date
maven33-interceptor.jar already up to date
maven3-interceptor-commons.jar already up to date
[sling-org-apache-sling-commons-cache-portal-1.8] $ /home/jenkins/tools/java/latest1.8/bin/java
-Xmx2g -Xms256m -cp /home/jenkins/jenkins-slave/maven33-agent.jar:/home/jenkins/tools/maven/apache-maven-3.3.9/boot/plexus-classworlds-2.5.2.jar:/home/jenkins/tools/maven/apache-maven-3.3.9/conf/logging
jenkins.maven3.agent.Maven33Main /home/jenkins/tools/maven/apache-maven-3.3.9 /home/jenkins/jenkins-slave/slave.jar
/home/jenkins/jenkins-slave/maven33-interceptor.jar /home/jenkins/jenkins-slave/maven3-interceptor-commons.jar
<===[JENKINS REMOTING CAPACITY]===>   channel started
Executing Maven:  -B -f <>
-Dmaven.repo.local=/home/jenkins/jenkins-slave/maven-repositories/1 -U clean deploy
[INFO] Scanning for projects...
[INFO] ------------------------------------------------------------------------
[INFO] Building Apache Sling Cache Portal Cache 0.1-SNAPSHOT
[INFO] ------------------------------------------------------------------------
[INFO] Downloading:
[INFO] Downloaded:
(1010 B at 2.5 KB/sec)
[INFO] Downloading:
[INFO] Downloaded:
(3 KB at 9.0 KB/sec)
[INFO] Downloading:
[INFO] Downloading:
is missing, no dependency information available
[INFO] Downloading:
[INFO] Downloading:
[INFO] Downloaded:
(12 KB at 35.1 KB/sec)
[JENKINS] Archiving disabled
[JENKINS] Archiving disabled
[INFO] ------------------------------------------------------------------------
[INFO] ------------------------------------------------------------------------
[INFO] Total time: 10.809 s
[INFO] Finished at: 2018-04-02T08:45:20+00:00
[INFO] Final Memory: 14M/297M
[INFO] ------------------------------------------------------------------------
Waiting for Jenkins to finish collecting data[ERROR] Failed to execute goal on project
Could not resolve dependencies for project
Could not find artifact
in Nexus ( -> [Help 1]
[ERROR] To see the full stack trace of the errors, re-run Maven with the -e switch.
[ERROR] Re-run Maven using the -X switch to enable full debug logging.
[ERROR] For more information about the errors and possible solutions, please read the following
[ERROR] [Help 1]

channel stopped
Recording test results

View raw message