sling-commits mailing list archives

Site index · List index
Message view « Date » · « Thread »
Top « Date » · « Thread »
From Apache Jenkins Server <jenk...@builds.apache.org>
Subject Build failed in Jenkins: sling-org-apache-sling-launchpad-testing-10 #60
Date Sat, 21 Apr 2018 12:49:53 GMT
See <https://builds.apache.org/job/sling-org-apache-sling-launchpad-testing-10/60/display/redirect>

------------------------------------------
[...truncated 2.93 KB...]
[INFO] Downloading: http://repository.apache.org/snapshots/org/apache/sling/org.apache.sling.launchpad.test-bundles/0.0.5-SNAPSHOT/org.apache.sling.launchpad.test-bundles-0.0.5-20180417.230957-18.txt
[INFO] Downloaded: http://repository.apache.org/snapshots/org/apache/sling/org.apache.sling.launchpad.test-bundles/0.0.5-SNAPSHOT/org.apache.sling.launchpad.test-bundles-0.0.5-20180417.230957-18.txt
(2 KB at 4.9 KB/sec)
[INFO] Downloading: http://repository.apache.org/snapshots/org/apache/sling/org.apache.sling.starter/11-SNAPSHOT/maven-metadata.xml
[INFO] Downloaded: http://repository.apache.org/snapshots/org/apache/sling/org.apache.sling.starter/11-SNAPSHOT/maven-metadata.xml
(2 KB at 4.5 KB/sec)
[INFO] Downloading: http://repository.apache.org/snapshots/org/apache/sling/org.apache.sling.starter/11-SNAPSHOT/org.apache.sling.starter-11-20180421.065851-32-slingfeature.txt
[INFO] Downloaded: http://repository.apache.org/snapshots/org/apache/sling/org.apache.sling.starter/11-SNAPSHOT/org.apache.sling.starter-11-20180421.065851-32-slingfeature.txt
(31 KB at 99.3 KB/sec)
[INFO] Downloading: http://repository.apache.org/snapshots/org/apache/sling/org.apache.sling.sample.slingshot/0.8.1-SNAPSHOT/maven-metadata.xml
[INFO] Downloaded: http://repository.apache.org/snapshots/org/apache/sling/org.apache.sling.sample.slingshot/0.8.1-SNAPSHOT/maven-metadata.xml
(2 KB at 4.6 KB/sec)
[INFO] Extended Maven classpath (scope 'provided') by the dependencies extracted from the
Sling model.
[INFO]                                                                         
[INFO] ------------------------------------------------------------------------
[INFO] Building Apache Sling Launchpad Testing 11-SNAPSHOT
[INFO] ------------------------------------------------------------------------
[INFO] Downloading: http://repository.apache.org/snapshots/org/apache/sling/org.apache.sling.launchpad.integration-tests/1.0.7-SNAPSHOT/maven-metadata.xml
[INFO] Downloaded: http://repository.apache.org/snapshots/org/apache/sling/org.apache.sling.launchpad.integration-tests/1.0.7-SNAPSHOT/maven-metadata.xml
(2 KB at 3.0 KB/sec)
[INFO] Downloading: http://repository.apache.org/snapshots/org/apache/sling/org.apache.sling.junit.teleporter/1.0.17-SNAPSHOT/maven-metadata.xml
[INFO] Downloaded: http://repository.apache.org/snapshots/org/apache/sling/org.apache.sling.junit.teleporter/1.0.17-SNAPSHOT/maven-metadata.xml
(1021 B at 3.2 KB/sec)
[INFO] Downloading: http://repository.apache.org/snapshots/org/apache/sling/org.apache.sling.launchpad.test-services/2.0.15-SNAPSHOT/maven-metadata.xml
[INFO] Downloaded: http://repository.apache.org/snapshots/org/apache/sling/org.apache.sling.launchpad.test-services/2.0.15-SNAPSHOT/maven-metadata.xml
(2 KB at 3.2 KB/sec)
[INFO] Downloading: http://repository.apache.org/snapshots/org/apache/sling/org.apache.sling.launchpad.test-bundles/0.0.5-SNAPSHOT/org.apache.sling.launchpad.test-bundles-0.0.5-20180417.230957-18.pom
[INFO] Downloaded: http://repository.apache.org/snapshots/org/apache/sling/org.apache.sling.launchpad.test-bundles/0.0.5-SNAPSHOT/org.apache.sling.launchpad.test-bundles-0.0.5-20180417.230957-18.pom
(3 KB at 7.0 KB/sec)
[INFO] Downloading: http://repository.apache.org/snapshots/org/apache/sling/org.apache.sling.starter/11-SNAPSHOT/org.apache.sling.starter-11-20180421.065851-32.pom
[INFO] Downloaded: http://repository.apache.org/snapshots/org/apache/sling/org.apache.sling.starter/11-SNAPSHOT/org.apache.sling.starter-11-20180421.065851-32.pom
(8 KB at 24.3 KB/sec)
[INFO] Downloading: http://repository.apache.org/snapshots/org/apache/sling/org.apache.sling.launchpad.test-fragment/2.0.15-SNAPSHOT/maven-metadata.xml
[INFO] Downloaded: http://repository.apache.org/snapshots/org/apache/sling/org.apache.sling.launchpad.test-fragment/2.0.15-SNAPSHOT/maven-metadata.xml
(2 KB at 3.2 KB/sec)
[INFO] Downloading: http://repository.apache.org/snapshots/org/apache/sling/org.apache.sling.launchpad.test-services-war/2.0.15-SNAPSHOT/maven-metadata.xml
[INFO] Downloaded: http://repository.apache.org/snapshots/org/apache/sling/org.apache.sling.launchpad.test-services-war/2.0.15-SNAPSHOT/maven-metadata.xml
(2 KB at 3.3 KB/sec)
[INFO] Downloading: http://repository.apache.org/snapshots/org/apache/sling/org.apache.sling.launchpad.test-services-war/2.0.15-SNAPSHOT/org.apache.sling.launchpad.test-services-war-2.0.15-20180419.214806-13.pom
[INFO] Downloaded: http://repository.apache.org/snapshots/org/apache/sling/org.apache.sling.launchpad.test-services-war/2.0.15-SNAPSHOT/org.apache.sling.launchpad.test-services-war-2.0.15-20180419.214806-13.pom
(6 KB at 18.3 KB/sec)
[INFO] Downloading: http://repository.apache.org/snapshots/org/apache/sling/org.apache.sling.auth.form/1.0.9-SNAPSHOT/maven-metadata.xml
[INFO] Downloaded: http://repository.apache.org/snapshots/org/apache/sling/org.apache.sling.auth.form/1.0.9-SNAPSHOT/maven-metadata.xml
(1018 B at 3.2 KB/sec)
[INFO] Downloading: http://repository.apache.org/snapshots/org/apache/sling/org.apache.sling.starter.content/1.0.0-SNAPSHOT/maven-metadata.xml
[INFO] Downloaded: http://repository.apache.org/snapshots/org/apache/sling/org.apache.sling.starter.content/1.0.0-SNAPSHOT/maven-metadata.xml
(1016 B at 3.3 KB/sec)
[INFO] Downloading: http://repository.apache.org/snapshots/org/apache/sling/org.apache.sling.starter.content/1.0.0-SNAPSHOT/org.apache.sling.starter.content-1.0.0-20180420.213108-14.pom
[INFO] Downloaded: http://repository.apache.org/snapshots/org/apache/sling/org.apache.sling.starter.content/1.0.0-SNAPSHOT/org.apache.sling.starter.content-1.0.0-20180420.213108-14.pom
(5 KB at 15.0 KB/sec)
[INFO] Downloading: http://repository.apache.org/snapshots/org/apache/sling/org.apache.sling.launchpad.test-services-war/2.0.15-SNAPSHOT/org.apache.sling.launchpad.test-services-war-2.0.15-20180419.214806-13.war
[INFO] Downloading: http://repository.apache.org/snapshots/org/apache/sling/org.apache.sling.starter.content/1.0.0-SNAPSHOT/org.apache.sling.starter.content-1.0.0-20180420.213108-14.jar
[INFO] Downloaded: http://repository.apache.org/snapshots/org/apache/sling/org.apache.sling.launchpad.test-services-war/2.0.15-SNAPSHOT/org.apache.sling.launchpad.test-services-war-2.0.15-20180419.214806-13.war
(14 KB at 45.7 KB/sec)
[INFO] Downloaded: http://repository.apache.org/snapshots/org/apache/sling/org.apache.sling.starter.content/1.0.0-SNAPSHOT/org.apache.sling.starter.content-1.0.0-20180420.213108-14.jar
(145 KB at 288.8 KB/sec)
[INFO] 
[INFO] --- maven-clean-plugin:3.0.0:clean (default-clean) @ org.apache.sling.launchpad.testing
---
[INFO] Deleting <https://builds.apache.org/job/sling-org-apache-sling-launchpad-testing-10/ws/target>
[INFO] 
[INFO] --- maven-enforcer-plugin:3.0.0-M1:enforce (enforce-property-values) @ org.apache.sling.launchpad.testing
---
[INFO] 
[INFO] --- maven-enforcer-plugin:3.0.0-M1:enforce (enforce-java) @ org.apache.sling.launchpad.testing
---
[INFO] 
[INFO] --- maven-enforcer-plugin:3.0.0-M1:enforce (ban-maven-scr-plugin) @ org.apache.sling.launchpad.testing
---
[INFO] 
[INFO] --- maven-remote-resources-plugin:1.5:process (process-resource-bundles) @ org.apache.sling.launchpad.testing
---
[INFO] 
[INFO] --- maven-remote-resources-plugin:1.5:process (default) @ org.apache.sling.launchpad.testing
---
[INFO] 
[INFO] --- maven-resources-plugin:2.7:resources (default-resources) @ org.apache.sling.launchpad.testing
---
[INFO] Using 'UTF-8' encoding to copy filtered resources.
[INFO] skip non existing resourceDirectory <https://builds.apache.org/job/sling-org-apache-sling-launchpad-testing-10/ws/src/main/resources>
[INFO] Copying 3 resources
[INFO] Copying 3 resources
[INFO] 
[INFO] --- build-helper-maven-plugin:3.0.0:reserve-network-port (reserve-network-port) @ org.apache.sling.launchpad.testing
---
[INFO] Port assigned41000
[INFO] Reserved port 41000 for http.port
[INFO] Port assigned41001
[INFO] Reserved port 41001 for sling.control.port
[INFO] 
[INFO] --- maven-compiler-plugin:3.7.0:compile (default-compile) @ org.apache.sling.launchpad.testing
---
[INFO] No sources to compile
[INFO] 
[INFO] --- maven-resources-plugin:2.7:testResources (default-testResources) @ org.apache.sling.launchpad.testing
---
[INFO] Using 'UTF-8' encoding to copy filtered resources.
[INFO] Copying 1 resource
[INFO] Copying 3 resources
[INFO] Copying 3 resources
[INFO] 
[INFO] --- maven-compiler-plugin:3.7.0:testCompile (default-testCompile) @ org.apache.sling.launchpad.testing
---
[INFO] No sources to compile
[INFO] 
[INFO] --- maven-surefire-plugin:2.20.1:test (default-test) @ org.apache.sling.launchpad.testing
---
[JENKINS] Recording test results
[INFO] 
[INFO] --- slingstart-maven-plugin:1.7.16:prepare-package (default-prepare-package) @ org.apache.sling.launchpad.testing
---
[INFO] 
[INFO] --- slingstart-maven-plugin:1.7.16:attach-slingfeature (default-attach-slingfeature)
@ org.apache.sling.launchpad.testing ---
[INFO] 
[INFO] --- slingstart-maven-plugin:1.7.16:package (default-package) @ org.apache.sling.launchpad.testing
---
[INFO] Packaging standalone jar...
[INFO] Building zip: <https://builds.apache.org/job/sling-org-apache-sling-launchpad-testing-10/ws/target/org.apache.sling.launchpad.testing-11-SNAPSHOT.jar>
[INFO] 
[INFO] >>> maven-source-plugin:3.0.1:jar (attach-sources) > generate-sources @
org.apache.sling.launchpad.testing >>>
[INFO] 
[INFO] --- maven-enforcer-plugin:3.0.0-M1:enforce (enforce-property-values) @ org.apache.sling.launchpad.testing
---
[INFO] 
[INFO] --- maven-enforcer-plugin:3.0.0-M1:enforce (enforce-java) @ org.apache.sling.launchpad.testing
---
[INFO] 
[INFO] --- maven-enforcer-plugin:3.0.0-M1:enforce (ban-maven-scr-plugin) @ org.apache.sling.launchpad.testing
---
[WARNING] Failed to getClass for org.apache.maven.plugins.source.SourceJarMojo
[INFO] 
[INFO] <<< maven-source-plugin:3.0.1:jar (attach-sources) < generate-sources @
org.apache.sling.launchpad.testing <<<
[INFO] 
[INFO] --- maven-source-plugin:3.0.1:jar (attach-sources) @ org.apache.sling.launchpad.testing
---
[INFO] Building jar: <https://builds.apache.org/job/sling-org-apache-sling-launchpad-testing-10/ws/target/org.apache.sling.launchpad.testing-11-SNAPSHOT-sources.jar>
[INFO] 
[INFO] --- maven-site-plugin:3.5.1:attach-descriptor (attach-descriptor) @ org.apache.sling.launchpad.testing
---
[INFO] 
[INFO] --- slingstart-maven-plugin:1.7.16:start (start-container) @ org.apache.sling.launchpad.testing
---
[INFO] Using launchpad jar being generated as this project's primary artifact: '<https://builds.apache.org/job/sling-org-apache-sling-launchpad-testing-10/ws/target/org.apache.sling.launchpad.testing-11-SNAPSHOT.jar'!>
[INFO] Starting Launchpad _-41000...
-------------------------------------------------------------------
Slingstart application: <https://builds.apache.org/job/sling-org-apache-sling-launchpad-testing-10/ws/target/_-41000/org.apache.sling.launchpad.testing-11-SNAPSHOT.jar>
Main class: org.apache.sling.launchpad.app.Main
Listener Port: 51921
Arguments: [-p, 41000, -j, 41001]
-------------------------------------------------------------------
21.04.2018 12:49:21.352 *INFO * [main] Setting sling.home=sling (default)
21.04.2018 12:49:21.356 *INFO * [main] Starting Apache Sling in <https://builds.apache.org/job/sling-org-apache-sling-launchpad-testing-10/ws/target/_-41000/sling>
21.04.2018 12:49:21.359 *INFO * [main] Sling  Extension Lib Home : <https://builds.apache.org/job/sling-org-apache-sling-launchpad-testing-10/ws/target/_-41000/sling/ext>
21.04.2018 12:49:21.360 *INFO * [main] Checking launcher JAR in folder <https://builds.apache.org/job/sling-org-apache-sling-launchpad-testing-10/ws/target/_-41000/sling>
21.04.2018 12:49:21.373 *INFO * [main] Installing new launcher: jar:<https://builds.apache.org/job/sling-org-apache-sling-launchpad-testing-10/ws/target/_-41000/org.apache.sling.launchpad.testing-11-SNAPSHOT.jar!/resources/org.apache.sling.launchpad.base.jar,>
5.6.10.2_6_26 (org.apache.sling.launchpad.base.jar.1524314961373)
21.04.2018 12:49:21.375 *INFO * [main] Loading launcher class org.apache.sling.launchpad.base.app.MainDelegate
from org.apache.sling.launchpad.base.jar.1524314961373
21.04.2018 12:49:21.375 *INFO * [main] External Libs Home (ext) is null or does not exists.
21.04.2018 12:49:21.415 *INFO * [main] Setting sling.launchpad=<https://builds.apache.org/job/sling-org-apache-sling-launchpad-testing-10/ws/target/_-41000/sling>
21.04.2018 12:49:21.415 *INFO * [main] Setting org.osgi.service.http.port=41000
21.04.2018 12:49:21.415 *INFO * [main] Setting sling.control.socket=41001
21.04.2018 12:49:21.416 *INFO * [main] Starting launcher ...
21.04.2018 12:49:21.425 *INFO * [main] HTTP server port: 41000
WARNING: An illegal reflective access operation has occurred
WARNING: Illegal reflective access by org.apache.felix.framework.ext.ClassPathExtenderFactory$DefaultClassLoaderExtender
(<https://builds.apache.org/job/sling-org-apache-sling-launchpad-testing-10/ws/target/_-41000/sling/org.apache.sling.launchpad.base.jar.1524314961373)>
to method java.net.URLClassLoader.addURL(java.net.URL)
WARNING: Please consider reporting this to the maintainers of org.apache.felix.framework.ext.ClassPathExtenderFactory$DefaultClassLoaderExtender
WARNING: Use --illegal-access=warn to enable warnings of further illegal reflective access
operations
WARNING: All illegal access operations will be denied in a future release
21.04.2018 12:49:22.511 *INFO* [OsgiInstallerImpl] org.apache.sling.installer.core.impl.OsgiInstallerImpl
Apache Sling OSGi Installer Service started.
21.04.2018 12:49:22.559 *INFO* [FelixStartLevel] org.apache.sling.commons.logservice Service
[org.apache.sling.commons.logservice.internal.LogServiceFactory,17, [org.osgi.service.log.LogService]]
ServiceEvent REGISTERED
21.04.2018 12:49:22.561 *INFO* [FelixStartLevel] org.apache.sling.commons.logservice Service
[org.apache.sling.commons.logservice.internal.LogReaderServiceFactory,18, [org.osgi.service.log.LogReaderService]]
ServiceEvent REGISTERED
21.04.2018 12:49:22.564 *INFO* [FelixStartLevel] org.apache.sling.commons.logservice BundleEvent
STARTED
21.04.2018 12:49:22.570 *INFO* [FelixStartLevel] org.apache.sling.launchpad.installer BundleEvent
RESOLVED
21.04.2018 12:49:22.573 *INFO* [FelixStartLevel] org.apache.sling.launchpad.installer BundleEvent
STARTING
21.04.2018 12:49:22.575 *INFO* [FelixStartLevel] org.apache.sling.launchpad.installer BundleEvent
STARTED
21.04.2018 12:49:22.576 *INFO* [FelixStartLevel] org.apache.geronimo.specs.geronimo-atinject_1.0_spec
BundleEvent RESOLVED
21.04.2018 12:49:22.581 *INFO* [FelixStartLevel] org.apache.geronimo.specs.geronimo-atinject_1.0_spec
BundleEvent STARTING
21.04.2018 12:49:22.581 *INFO* [FelixStartLevel] org.apache.geronimo.specs.geronimo-atinject_1.0_spec
BundleEvent STARTED
21.04.2018 12:49:22.582 *INFO* [FelixStartLevel] org.apache.sling.settings BundleEvent STARTING
21.04.2018 12:49:22.585 *INFO* [FelixStartLevel] org.apache.sling.settings.impl.SlingSettingsServiceImpl
Read Sling ID null from file <https://builds.apache.org/job/sling-org-apache-sling-launchpad-testing-10/ws/target/_-41000/sling/felix/bundle16/data/sling.id.file>
21.04.2018 12:49:22.587 *INFO* [FelixStartLevel] org.apache.sling.settings.impl.SlingSettingsServiceImpl
Created new Sling ID 196297c6-50d9-431a-9d9b-0baf4909f9d0
21.04.2018 12:49:22.591 *INFO* [FelixStartLevel] org.apache.sling.settings.impl.SlingSettingsServiceImpl
Active run modes: [oak_tar]
21.04.2018 12:49:22.591 *INFO* [FelixStartLevel] org.apache.sling.settings Service [Apache
Sling Settings Service,19, [org.apache.sling.settings.SlingSettingsService]] ServiceEvent
REGISTERED
21.04.2018 12:49:22.593 *INFO* [FelixStartLevel] org.apache.sling.launchpad.installer Service
[Apache Sling Launchpad Startup Listener,20, [org.apache.sling.installer.api.event.InstallationListener]]
ServiceEvent REGISTERED
21.04.2018 12:49:22.594 *INFO* [FelixStartLevel] org.apache.sling.launchpad.installer.impl.LaunchpadConfigInstaller
Activating launchpad config installer, configuration path=resources/config, install path=resources/install
21.04.2018 12:49:22.853 *INFO* [FelixStartLevel] org.apache.sling.launchpad.installer.impl.LaunchpadConfigInstaller
183 resources registered with OsgiInstaller
21.04.2018 12:49:22.857 *INFO* [FelixStartLevel] org.apache.sling.settings Service [Apache
Sling Sling Properties Configuration Printer,21, [org.apache.sling.settings.impl.SlingPropertiesPrinter]]
ServiceEvent REGISTERED
21.04.2018 12:49:22.858 *INFO* [FelixStartLevel] org.apache.sling.settings Service [Apache
Sling Sling Settings Configuration Printer,22, [org.apache.sling.settings.impl.SlingSettingsPrinter]]
ServiceEvent REGISTERED
21.04.2018 12:49:22.860 *INFO* [FelixStartLevel] org.apache.sling.settings Service [org.apache.sling.settings.impl.SlingSettingsServiceImpl,23,
[org.osgi.service.cm.ManagedService]] ServiceEvent REGISTERED
21.04.2018 12:49:22.861 *INFO* [FelixStartLevel] org.apache.sling.settings BundleEvent STARTED
21.04.2018 12:49:22.866 *INFO* [FelixStartLevel] org.apache.aries.util BundleEvent RESOLVED
21.04.2018 12:49:22.866 *INFO* [FelixStartLevel] org.apache.aries.util BundleEvent STARTING
21.04.2018 12:49:22.866 *INFO* [FelixStartLevel] org.apache.aries.util BundleEvent STARTED
21.04.2018 12:49:22.868 *INFO* [FelixStartLevel] org.apache.sling.commons.log BundleEvent
STARTING
21.04.2018 12:49:22.902 *INFO* [FelixStartLevel] org.apache.sling.commons.log Service [org.apache.sling.commons.log.LogManager,24,
[org.osgi.service.cm.ManagedService]] ServiceEvent REGISTERED
21.04.2018 12:49:22.908 *INFO* [FelixStartLevel] org.apache.sling.commons.log Service [org.apache.sling.commons.log.LogManager.factory.writer,25,
[org.osgi.service.cm.ManagedServiceFactory]] ServiceEvent REGISTERED
21.04.2018 12:49:22.910 *INFO* [FelixStartLevel] org.apache.sling.commons.log Service [org.apache.sling.commons.log.LogManager.factory.config,26,
[org.osgi.service.cm.ManagedServiceFactory]] ServiceEvent REGISTERED
21.04.2018 12:49:22.914 *INFO* [FelixStartLevel] org.apache.sling.commons.log Service [Sling
Log Panel Support,27, [org.apache.sling.commons.log.logback.webconsole.LogPanel]] ServiceEvent
REGISTERED
21.04.2018 12:49:22.916 *INFO* [FelixStartLevel] org.apache.sling.commons.log Service [Sling
Log Configuration Printer,28, [org.apache.sling.commons.log.logback.internal.SlingConfigurationPrinter]]
ServiceEvent REGISTERED
21.04.2018 12:49:22.917 *INFO* [FelixStartLevel] org.apache.sling.commons.log Service [Sling
Log Reset Event Handler,29, [org.osgi.service.event.EventHandler]] ServiceEvent REGISTERED
21.04.2018 12:49:23.007 *INFO * [main] Startup completed
21.04.2018 12:49:23.192 *INFO* [OsgiInstallerImpl] org.apache.sling.audit.osgi.installer Installed
configuration org.apache.sling.serviceusermapping.impl.ServiceUserMapperImpl.amended.ef0dbca5-67b2-4d33-8cdc-01b815d114ed
from resource TaskResource(url=launchpad:resources/config/org.apache.sling.serviceusermapping.impl.ServiceUserMapperImpl.amended-jcr-install.config,
entity=config:org.apache.sling.serviceusermapping.impl.ServiceUserMapperImpl.amended.jcr-install,
state=INSTALL, attributes=[org.apache.sling.installer.api.tasks.ResourceTransformer=:16:,
service.factoryPid=org.apache.sling.serviceusermapping.impl.ServiceUserMapperImpl.amended,
service.pid=jcr-install], digest=c54b829f7b7740a799d99e251af020c9)
21.04.2018 12:49:23.194 *INFO* [OsgiInstallerImpl] org.apache.sling.audit.osgi.installer Installed
configuration org.apache.sling.serviceusermapping.impl.ServiceUserMapperImpl.amended.9c88411b-ba8f-427f-8ba0-0e98a06bbe8e
from resource TaskResource(url=launchpad:resources/config/org.apache.sling.serviceusermapping.impl.ServiceUserMapperImpl.amended-jcr-resource.config,
entity=config:org.apache.sling.serviceusermapping.impl.ServiceUserMapperImpl.amended.jcr-resource,
state=INSTALL, attributes=[org.apache.sling.installer.api.tasks.ResourceTransformer=:16:,
service.factoryPid=org.apache.sling.serviceusermapping.impl.ServiceUserMapperImpl.amended,
service.pid=jcr-resource], digest=8b9c2b1535ffb961711fa342f873d589)
21.04.2018 12:49:23.195 *INFO* [OsgiInstallerImpl] org.apache.sling.audit.osgi.installer Installed
configuration org.apache.sling.serviceusermapping.impl.ServiceUserMapperImpl.amended.1f270d26-4b05-47c7-8abe-cfe847396f87
from resource TaskResource(url=launchpad:resources/config/org.apache.sling.serviceusermapping.impl.ServiceUserMapperImpl.amended-observation.config,
entity=config:org.apache.sling.serviceusermapping.impl.ServiceUserMapperImpl.amended.observation,
state=INSTALL, attributes=[org.apache.sling.installer.api.tasks.ResourceTransformer=:16:,
service.factoryPid=org.apache.sling.serviceusermapping.impl.ServiceUserMapperImpl.amended,
service.pid=observation], digest=b358fca04fc5775b5fee0983520f157b)
21.04.2018 12:49:23.198 *INFO* [OsgiInstallerImpl] org.apache.sling.audit.osgi.installer Installed
configuration org.apache.sling.serviceusermapping.impl.ServiceUserMapperImpl.amended.cccb8ac9-892f-4033-9012-c08684f6be51
from resource TaskResource(url=launchpad:resources/config/org.apache.sling.serviceusermapping.impl.ServiceUserMapperImpl.amended-resourceresolver.config,
entity=config:org.apache.sling.serviceusermapping.impl.ServiceUserMapperImpl.amended.resourceresolver,
state=INSTALL, attributes=[org.apache.sling.installer.api.tasks.ResourceTransformer=:16:,
service.factoryPid=org.apache.sling.serviceusermapping.impl.ServiceUserMapperImpl.amended,
service.pid=resourceresolver], digest=d317bcbc20315e21bdbb0480199d7a55)
21.04.2018 12:49:23.200 *INFO* [OsgiInstallerImpl] org.apache.sling.audit.osgi.installer Installed
configuration org.apache.sling.serviceusermapping.impl.ServiceUserMapperImpl.amended.c832b126-47a4-4be4-b6fd-97330d88646b
from resource TaskResource(url=launchpad:resources/config/org.apache.sling.serviceusermapping.impl.ServiceUserMapperImpl.amended-scripting.config,
entity=config:org.apache.sling.serviceusermapping.impl.ServiceUserMapperImpl.amended.scripting,
state=INSTALL, attributes=[org.apache.sling.installer.api.tasks.ResourceTransformer=:16:,
service.factoryPid=org.apache.sling.serviceusermapping.impl.ServiceUserMapperImpl.amended,
service.pid=scripting], digest=479bf62d1c800aa03dba13706319afd1)
21.04.2018 12:49:23.203 *INFO* [OsgiInstallerImpl] org.apache.sling.audit.osgi.installer Installed
configuration org.apache.sling.serviceusermapping.impl.ServiceUserMapperImpl.amended.fb1aef29-769b-4250-af52-99aa0c9f14d4
from resource TaskResource(url=launchpad:resources/config/org.apache.sling.serviceusermapping.impl.ServiceUserMapperImpl.amended-servletsresolver.config,
entity=config:org.apache.sling.serviceusermapping.impl.ServiceUserMapperImpl.amended.servletsresolver,
state=INSTALL, attributes=[org.apache.sling.installer.api.tasks.ResourceTransformer=:16:,
service.factoryPid=org.apache.sling.serviceusermapping.impl.ServiceUserMapperImpl.amended,
service.pid=servletsresolver], digest=36b119a784d011be61d06b5de31d4753)
21.04.2018 12:49:23.210 *INFO* [OsgiInstallerImpl] org.apache.sling.audit.osgi.installer Installed
configuration org.apache.sling.serviceusermapping.impl.ServiceUserMapperImpl.amended.d921e506-9cd6-4d6e-adc7-15ce07cda0d0
from resource TaskResource(url=launchpad:resources/config/org.apache.sling.serviceusermapping.impl.ServiceUserMapperImpl.amended-sling-caconfig.config,
entity=config:org.apache.sling.serviceusermapping.impl.ServiceUserMapperImpl.amended.sling-caconfig,
state=INSTALL, attributes=[org.apache.sling.installer.api.tasks.ResourceTransformer=:16:,
service.factoryPid=org.apache.sling.serviceusermapping.impl.ServiceUserMapperImpl.amended,
service.pid=sling-caconfig], digest=f21cac1a9c2ba6661442ce589b9242f3)
21.04.2018 12:49:23.212 *INFO* [OsgiInstallerImpl] org.apache.sling.audit.osgi.installer Installed
configuration org.apache.sling.serviceusermapping.impl.ServiceUserMapperImpl.amended.becd1371-10bc-4010-87ab-f4288c20fdba
from resource TaskResource(url=launchpad:resources/config/org.apache.sling.serviceusermapping.impl.ServiceUserMapperImpl.amended-sling.discovery.config,
entity=config:org.apache.sling.serviceusermapping.impl.ServiceUserMapperImpl.amended.sling.discovery,
state=INSTALL, attributes=[org.apache.sling.installer.api.tasks.ResourceTransformer=:16:,
service.factoryPid=org.apache.sling.serviceusermapping.impl.ServiceUserMapperImpl.amended,
service.pid=sling.discovery], digest=49f8c02a6e35568185d429678b3264ee)
21.04.2018 12:49:23.214 *INFO* [OsgiInstallerImpl] org.apache.sling.audit.osgi.installer Installed
configuration org.apache.sling.serviceusermapping.impl.ServiceUserMapperImpl.amended.a48d53e7-03c9-4fc9-8f71-a2841b6b88fa
from resource TaskResource(url=launchpad:resources/config/org.apache.sling.serviceusermapping.impl.ServiceUserMapperImpl.amended-sling.event.config,
entity=config:org.apache.sling.serviceusermapping.impl.ServiceUserMapperImpl.amended.sling.event,
state=INSTALL, attributes=[org.apache.sling.installer.api.tasks.ResourceTransformer=:16:,
service.factoryPid=org.apache.sling.serviceusermapping.impl.ServiceUserMapperImpl.amended,
service.pid=sling.event], digest=93dccd670f84159c69e74973251b7371)
21.04.2018 12:49:23.216 *INFO* [OsgiInstallerImpl] org.apache.sling.audit.osgi.installer Installed
configuration org.apache.sling.serviceusermapping.impl.ServiceUserMapperImpl.amended.066dbc22-ba1a-4a11-b1f8-5116d7be79e3
from resource TaskResource(url=launchpad:resources/config/org.apache.sling.serviceusermapping.impl.ServiceUserMapperImpl.amended-sling.slingshot.config,
entity=config:org.apache.sling.serviceusermapping.impl.ServiceUserMapperImpl.amended.sling.slingshot,
state=INSTALL, attributes=[org.apache.sling.installer.api.tasks.ResourceTransformer=:16:,
service.factoryPid=org.apache.sling.serviceusermapping.impl.ServiceUserMapperImpl.amended,
service.pid=sling.slingshot], digest=ac3800c55b3adba9322abd54ff91dfda)
21.04.2018 12:49:23.219 *INFO* [OsgiInstallerImpl] org.apache.sling.audit.osgi.installer Installed
configuration org.apache.sling.serviceusermapping.impl.ServiceUserMapperImpl.amended.1d406d8e-0276-4d34-9d37-f4bd3ed9db82
from resource TaskResource(url=launchpad:resources/config/org.apache.sling.serviceusermapping.impl.ServiceUserMapperImpl.amended-validation.config,
entity=config:org.apache.sling.serviceusermapping.impl.ServiceUserMapperImpl.amended.validation,
state=INSTALL, attributes=[org.apache.sling.installer.api.tasks.ResourceTransformer=:16:,
service.factoryPid=org.apache.sling.serviceusermapping.impl.ServiceUserMapperImpl.amended,
service.pid=validation], digest=c08b4504cea7305ee153a040fa8177ca)
Apr 21, 2018 12:49:25 PM org.apache.tika.config.InitializableProblemHandler$3 handleInitializableProblem
WARNING: JBIG2ImageReader not loaded. jbig2 files will be ignored
See https://pdfbox.apache.org/2.0/dependencies.html#jai-image-io
for optional dependencies.
TIFFImageWriter not loaded. tiff files will not be processed
See https://pdfbox.apache.org/2.0/dependencies.html#jai-image-io
for optional dependencies.
J2KImageReader not loaded. JPEG2000 files will not be processed.
See https://pdfbox.apache.org/2.0/dependencies.html#jai-image-io
for optional dependencies.

Apr 21, 2018 12:49:25 PM org.apache.tika.config.InitializableProblemHandler$3 handleInitializableProblem
WARNING: org.xerial's sqlite-jdbc is not loaded.
Please provide the jar on your classpath to parse sqlite files.
See tika-parsers/pom.xml for the correct version.
[INFO] Started Launchpad '_-41000' at port 41000 [run modes: null]
[INFO] 
[INFO] --- maven-failsafe-plugin:2.20.1:integration-test (default) @ org.apache.sling.launchpad.testing
---
[JENKINS] Recording test results
[JENKINS] Archiving disabled
[INFO] ------------------------------------------------------------------------
[INFO] BUILD FAILURE
[INFO] ------------------------------------------------------------------------
[INFO] Total time: 01:03 min
[INFO] Finished at: 2018-04-21T12:49:33+00:00
[INFO] Final Memory: 41M/256M
[INFO] ------------------------------------------------------------------------
[JENKINS] Archiving disabled
Attempting to load ESAPI.properties via file I/O.
Attempting to load ESAPI.properties as resource file via file I/O.
Not found in 'org.owasp.esapi.resources' directory or file not readable: <https://builds.apache.org/job/sling-org-apache-sling-launchpad-testing-10/ws/target/_-41000/ESAPI.properties>
Not found in SystemResource Directory/resourceDirectory: .esapi/ESAPI.properties
Not found in 'user.home' (/home/jenkins) directory: /home/jenkins/esapi/ESAPI.properties
Loading ESAPI.properties via file I/O failed. Exception was: java.io.FileNotFoundException
Attempting to load ESAPI.properties via the classpath.
SUCCESSFULLY LOADED ESAPI.properties via the CLASSPATH from '/ (root)' using class loader
for DefaultSecurityConfiguration class!
Attempting to load validation.properties via file I/O.
Attempting to load validation.properties as resource file via file I/O.
Not found in 'org.owasp.esapi.resources' directory or file not readable: <https://builds.apache.org/job/sling-org-apache-sling-launchpad-testing-10/ws/target/_-41000/validation.properties>
Not found in SystemResource Directory/resourceDirectory: .esapi/validation.properties
Not found in 'user.home' (/home/jenkins) directory: /home/jenkins/esapi/validation.properties
Loading validation.properties via file I/O failed.
Attempting to load validation.properties via the classpath.
SUCCESSFULLY LOADED validation.properties via the CLASSPATH from '/ (root)' using class loader
for DefaultSecurityConfiguration class!
Waiting for Jenkins to finish collecting data
[ERROR] Failed to execute goal org.apache.maven.plugins:maven-failsafe-plugin:2.20.1:integration-test
(default) on project org.apache.sling.launchpad.testing: Execution default of goal org.apache.maven.plugins:maven-failsafe-plugin:2.20.1:integration-test
failed. NullPointerException -> [Help 1]
[ERROR] 
[ERROR] To see the full stack trace of the errors, re-run Maven with the -e switch.
[ERROR] Re-run Maven using the -X switch to enable full debug logging.
[ERROR] 
[ERROR] For more information about the errors and possible solutions, please read the following
articles:
[ERROR] [Help 1] http://cwiki.apache.org/confluence/display/MAVEN/PluginExecutionException
channel stopped
Terminating launchpad _-41000
21.04.2018 12:49:50.886 *INFO * [Apache Sling Terminator] Java VM is shutting down
21.04.2018 12:49:50.887 *INFO * [Apache Sling Terminator] Stopping Apache Sling
Archiving artifacts
21.04.2018 12:49:52.226 *INFO * [Sling Notifier] Apache Sling has been stopped
ERROR: Failed to archive {target/_-41000/sling/logs/request.log=target/_-41000/sling/logs/request.log,
target/_-41000/sling/logs/access.log=target/_-41000/sling/logs/access.log, target/_-41000/sling/logs/error.log=target/_-41000/sling/logs/error.log}
due to internal error; falling back to full archiving
java.lang.IllegalStateException: checksum mismatch after transfer (3616722760323969584 vs.
2097638756); /x1/jenkins/jenkins-home/jobs/sling-org-apache-sling-launchpad-testing-10/builds/60/archive/target/_-41000/sling/logs/error.log
may be corrupted
	at jsync.protocol.FileSequenceReader.read(FileSequenceReader.java:45)
	at com.cloudbees.jenkins.plugins.jsync.archiver.JSyncArtifactManager.remoteSync(JSyncArtifactManager.java:158)
	at com.cloudbees.jenkins.plugins.jsync.archiver.JSyncArtifactManager.archive(JSyncArtifactManager.java:76)
	at hudson.tasks.ArtifactArchiver.perform(ArtifactArchiver.java:245)
	at hudson.tasks.BuildStepCompatibilityLayer.perform(BuildStepCompatibilityLayer.java:81)
	at hudson.tasks.BuildStepMonitor$1.perform(BuildStepMonitor.java:20)
	at hudson.model.AbstractBuild$AbstractBuildExecution.perform(AbstractBuild.java:744)
	at hudson.model.AbstractBuild$AbstractBuildExecution.performAllBuildSteps(AbstractBuild.java:690)
	at hudson.maven.MavenModuleSetBuild$MavenModuleSetBuildExecution.post2(MavenModuleSetBuild.java:1073)
	at hudson.model.AbstractBuild$AbstractBuildExecution.post(AbstractBuild.java:635)
	at hudson.model.Run.execute(Run.java:1749)
	at hudson.maven.MavenModuleSetBuild.run(MavenModuleSetBuild.java:543)
	at hudson.model.ResourceController.execute(ResourceController.java:97)
	at hudson.model.Executor.run(Executor.java:429)
Recording test results

Mime
View raw message