sling-commits mailing list archives

Site index · List index
Message view « Date » · « Thread »
Top « Date » · « Thread »
From Apache Jenkins Server <jenk...@builds.apache.org>
Subject Build failed in Jenkins: sling-org-apache-sling-launchpad-testing-10 #35
Date Sat, 10 Mar 2018 12:49:50 GMT
See <https://builds.apache.org/job/sling-org-apache-sling-launchpad-testing-10/35/display/redirect>

------------------------------------------
[...truncated 20.25 KB...]
[INFO] Downloading: https://repo.maven.apache.org/maven2/org/apache/jackrabbit/jackrabbit-spi-commons/2.14.4/jackrabbit-spi-commons-2.14.4.pom
[INFO] Downloaded: https://repo.maven.apache.org/maven2/org/apache/jackrabbit/jackrabbit-spi-commons/2.14.4/jackrabbit-spi-commons-2.14.4.pom
(7 KB at 23.7 KB/sec)
[INFO] Downloading: https://repo.maven.apache.org/maven2/org/apache/jackrabbit/jackrabbit-spi/2.14.4/jackrabbit-spi-2.14.4.pom
[INFO] Downloaded: https://repo.maven.apache.org/maven2/org/apache/jackrabbit/jackrabbit-spi/2.14.4/jackrabbit-spi-2.14.4.pom
(4 KB at 31.2 KB/sec)
[INFO] Downloading: https://repo.maven.apache.org/maven2/org/apache/jackrabbit/jackrabbit-webdav/2.14.4/jackrabbit-webdav-2.14.4.pom
[INFO] Downloaded: https://repo.maven.apache.org/maven2/org/apache/jackrabbit/jackrabbit-webdav/2.14.4/jackrabbit-webdav-2.14.4.pom
(4 KB at 35.4 KB/sec)
[INFO] Downloading: https://repo.maven.apache.org/maven2/org/apache/sling/org.apache.sling.jcr.registration/1.0.4/org.apache.sling.jcr.registration-1.0.4.pom
[INFO] Downloaded: https://repo.maven.apache.org/maven2/org/apache/sling/org.apache.sling.jcr.registration/1.0.4/org.apache.sling.jcr.registration-1.0.4.pom
(5 KB at 31.7 KB/sec)
[INFO] Downloading: https://repo.maven.apache.org/maven2/org/apache/sling/org.apache.sling.discovery.base/2.0.8/org.apache.sling.discovery.base-2.0.8.pom
[INFO] Downloaded: https://repo.maven.apache.org/maven2/org/apache/sling/org.apache.sling.discovery.base/2.0.8/org.apache.sling.discovery.base-2.0.8.pom
(13 KB at 47.4 KB/sec)
[INFO] Downloading: https://repo.maven.apache.org/maven2/org/apache/sling/org.apache.sling.discovery.oak/1.2.22/org.apache.sling.discovery.oak-1.2.22.pom
[INFO] Downloaded: https://repo.maven.apache.org/maven2/org/apache/sling/org.apache.sling.discovery.oak/1.2.22/org.apache.sling.discovery.oak-1.2.22.pom
(13 KB at 39.1 KB/sec)
[INFO] Downloading: https://repo.maven.apache.org/maven2/org/apache/sling/org.apache.sling.discovery.support/1.0.4/org.apache.sling.discovery.support-1.0.4.pom
[INFO] Downloaded: https://repo.maven.apache.org/maven2/org/apache/sling/org.apache.sling.discovery.support/1.0.4/org.apache.sling.discovery.support-1.0.4.pom
(4 KB at 35.6 KB/sec)
[INFO] Downloading: https://repo.maven.apache.org/maven2/org/apache/sling/org.apache.sling.caconfig.impl/1.4.10/org.apache.sling.caconfig.impl-1.4.10.pom
[INFO] Downloaded: https://repo.maven.apache.org/maven2/org/apache/sling/org.apache.sling.caconfig.impl/1.4.10/org.apache.sling.caconfig.impl-1.4.10.pom
(12 KB at 130.1 KB/sec)
[INFO] Downloading: https://repo.maven.apache.org/maven2/org/apache/sling/org.apache.sling.validation.core/1.0.4/org.apache.sling.validation.core-1.0.4.pom
[INFO] Downloaded: https://repo.maven.apache.org/maven2/org/apache/sling/org.apache.sling.validation.core/1.0.4/org.apache.sling.validation.core-1.0.4.pom
(12 KB at 77.9 KB/sec)
[INFO] Downloading: https://repo.maven.apache.org/maven2/org/apache/felix/org.apache.felix.http.jetty/3.4.8/org.apache.felix.http.jetty-3.4.8.pom
[INFO] Downloaded: https://repo.maven.apache.org/maven2/org/apache/felix/org.apache.felix.http.jetty/3.4.8/org.apache.felix.http.jetty-3.4.8.pom
(10 KB at 451.4 KB/sec)
[INFO] Downloading: http://repository.apache.org/snapshots/org/apache/sling/org.apache.sling.launchpad.integration-tests/1.0.7-SNAPSHOT/org.apache.sling.launchpad.integration-tests-1.0.7-20180306.025734-24.jar
[INFO] Downloading: http://repository.apache.org/snapshots/org/apache/sling/org.apache.sling.junit.teleporter/1.0.17-SNAPSHOT/org.apache.sling.junit.teleporter-1.0.17-20180304.072546-19.jar
[INFO] Downloading: http://repository.apache.org/snapshots/org/apache/sling/org.apache.sling.launchpad.test-fragment/2.0.15-SNAPSHOT/org.apache.sling.launchpad.test-fragment-2.0.15-20180304.001556-10.jar
[INFO] Downloading: http://repository.apache.org/snapshots/org/apache/sling/org.apache.sling.launchpad.test-services/2.0.15-SNAPSHOT/org.apache.sling.launchpad.test-services-2.0.15-20180305.062440-9.jar
[INFO] Downloading: http://repository.apache.org/snapshots/org/apache/sling/org.apache.sling.launchpad.test-services-war/2.0.15-SNAPSHOT/org.apache.sling.launchpad.test-services-war-2.0.15-20180301.210200-7.war
[INFO] Downloaded: http://repository.apache.org/snapshots/org/apache/sling/org.apache.sling.launchpad.test-fragment/2.0.15-SNAPSHOT/org.apache.sling.launchpad.test-fragment-2.0.15-20180304.001556-10.jar
(9 KB at 28.1 KB/sec)
[INFO] Downloading: http://repository.apache.org/snapshots/org/apache/sling/org.apache.sling.auth.form/1.0.9-SNAPSHOT/org.apache.sling.auth.form-1.0.9-20180305.164326-1784.jar
[INFO] Downloaded: http://repository.apache.org/snapshots/org/apache/sling/org.apache.sling.launchpad.test-services-war/2.0.15-SNAPSHOT/org.apache.sling.launchpad.test-services-war-2.0.15-20180301.210200-7.war
(14 KB at 42.6 KB/sec)
[INFO] Downloading: http://repository.apache.org/snapshots/org/apache/sling/org.apache.sling.launchpad.content/2.0.13-SNAPSHOT/org.apache.sling.launchpad.content-2.0.13-20180212.174207-29.jar
[INFO] Downloaded: http://repository.apache.org/snapshots/org/apache/sling/org.apache.sling.junit.teleporter/1.0.17-SNAPSHOT/org.apache.sling.junit.teleporter-1.0.17-20180304.072546-19.jar
(37 KB at 93.5 KB/sec)
[INFO] Downloaded: http://repository.apache.org/snapshots/org/apache/sling/org.apache.sling.launchpad.test-services/2.0.15-SNAPSHOT/org.apache.sling.launchpad.test-services-2.0.15-20180305.062440-9.jar
(202 KB at 366.4 KB/sec)
[INFO] Downloaded: http://repository.apache.org/snapshots/org/apache/sling/org.apache.sling.launchpad.integration-tests/1.0.7-SNAPSHOT/org.apache.sling.launchpad.integration-tests-1.0.7-20180306.025734-24.jar
(485 KB at 712.6 KB/sec)
[INFO] Downloaded: http://repository.apache.org/snapshots/org/apache/sling/org.apache.sling.auth.form/1.0.9-SNAPSHOT/org.apache.sling.auth.form-1.0.9-20180305.164326-1784.jar
(59 KB at 72.9 KB/sec)
[INFO] Downloaded: http://repository.apache.org/snapshots/org/apache/sling/org.apache.sling.launchpad.content/2.0.13-SNAPSHOT/org.apache.sling.launchpad.content-2.0.13-20180212.174207-29.jar
(145 KB at 168.7 KB/sec)
[INFO] Downloading: https://repo.maven.apache.org/maven2/org/apache/jackrabbit/oak-segment-tar/1.6.8/oak-segment-tar-1.6.8.jar
[INFO] Downloading: https://repo.maven.apache.org/maven2/org/apache/httpcomponents/httpclient-cache/4.5.4/httpclient-cache-4.5.4.jar
[INFO] Downloading: https://repo.maven.apache.org/maven2/org/apache/httpcomponents/fluent-hc/4.5.4/fluent-hc-4.5.4.jar
[INFO] Downloading: https://repo.maven.apache.org/maven2/org/apache/sling/org.apache.sling.serviceuser.webconsole/1.0.0/org.apache.sling.serviceuser.webconsole-1.0.0.jar
[INFO] Downloading: https://repo.maven.apache.org/maven2/org/apache/aries/jmx/org.apache.aries.jmx.core/1.1.8/org.apache.aries.jmx.core-1.1.8.jar
[INFO] Downloaded: https://repo.maven.apache.org/maven2/org/apache/httpcomponents/fluent-hc/4.5.4/fluent-hc-4.5.4.jar
(31 KB at 667.1 KB/sec)
[INFO] Downloading: https://repo.maven.apache.org/maven2/org/apache/aries/jmx/org.apache.aries.jmx.whiteboard/1.2.0/org.apache.aries.jmx.whiteboard-1.2.0.jar
[INFO] Downloaded: https://repo.maven.apache.org/maven2/org/apache/httpcomponents/httpclient-cache/4.5.4/httpclient-cache-4.5.4.jar
(159 KB at 2724.4 KB/sec)
[INFO] Downloading: https://repo.maven.apache.org/maven2/org/apache/jackrabbit/jackrabbit-api/2.14.4/jackrabbit-api-2.14.4.jar
[INFO] Downloaded: https://repo.maven.apache.org/maven2/org/apache/aries/jmx/org.apache.aries.jmx.whiteboard/1.2.0/org.apache.aries.jmx.whiteboard-1.2.0.jar
(21 KB at 328.2 KB/sec)
[INFO] Downloading: https://repo.maven.apache.org/maven2/org/apache/jackrabbit/jackrabbit-jcr-commons/2.14.4/jackrabbit-jcr-commons-2.14.4.jar
[INFO] Downloaded: https://repo.maven.apache.org/maven2/org/apache/aries/jmx/org.apache.aries.jmx.core/1.1.8/org.apache.aries.jmx.core-1.1.8.jar
(125 KB at 1681.3 KB/sec)
[INFO] Downloading: https://repo.maven.apache.org/maven2/org/apache/jackrabbit/jackrabbit-jcr-rmi/2.14.4/jackrabbit-jcr-rmi-2.14.4.jar
[INFO] Downloaded: https://repo.maven.apache.org/maven2/org/apache/jackrabbit/jackrabbit-api/2.14.4/jackrabbit-api-2.14.4.jar
(42 KB at 184.0 KB/sec)
[INFO] Downloading: https://repo.maven.apache.org/maven2/org/apache/jackrabbit/jackrabbit-spi-commons/2.14.4/jackrabbit-spi-commons-2.14.4.jar
[INFO] Downloaded: https://repo.maven.apache.org/maven2/org/apache/sling/org.apache.sling.serviceuser.webconsole/1.0.0/org.apache.sling.serviceuser.webconsole-1.0.0.jar
(30 KB at 105.5 KB/sec)
[INFO] Downloading: https://repo.maven.apache.org/maven2/org/apache/jackrabbit/jackrabbit-spi/2.14.4/jackrabbit-spi-2.14.4.jar
[INFO] Downloaded: https://repo.maven.apache.org/maven2/org/apache/jackrabbit/jackrabbit-jcr-commons/2.14.4/jackrabbit-jcr-commons-2.14.4.jar
(394 KB at 1187.7 KB/sec)
[INFO] Downloading: https://repo.maven.apache.org/maven2/org/apache/jackrabbit/jackrabbit-webdav/2.14.4/jackrabbit-webdav-2.14.4.jar
[INFO] Downloaded: https://repo.maven.apache.org/maven2/org/apache/jackrabbit/jackrabbit-jcr-rmi/2.14.4/jackrabbit-jcr-rmi-2.14.4.jar
(428 KB at 957.6 KB/sec)
[INFO] Downloading: https://repo.maven.apache.org/maven2/org/apache/sling/org.apache.sling.caconfig.impl/1.4.10/org.apache.sling.caconfig.impl-1.4.10.jar
[INFO] Downloaded: https://repo.maven.apache.org/maven2/org/apache/jackrabbit/jackrabbit-spi/2.14.4/jackrabbit-spi-2.14.4.jar
(28 KB at 49.6 KB/sec)
[INFO] Downloaded: https://repo.maven.apache.org/maven2/org/apache/jackrabbit/jackrabbit-webdav/2.14.4/jackrabbit-webdav-2.14.4.jar
(357 KB at 546.7 KB/sec)
[INFO] Downloaded: https://repo.maven.apache.org/maven2/org/apache/jackrabbit/oak-segment-tar/1.6.8/oak-segment-tar-1.6.8.jar
(1977 KB at 2946.2 KB/sec)
[INFO] Downloaded: https://repo.maven.apache.org/maven2/org/apache/sling/org.apache.sling.caconfig.impl/1.4.10/org.apache.sling.caconfig.impl-1.4.10.jar
(201 KB at 295.6 KB/sec)
[INFO] Downloaded: https://repo.maven.apache.org/maven2/org/apache/jackrabbit/jackrabbit-spi-commons/2.14.4/jackrabbit-spi-commons-2.14.4.jar
(782 KB at 1105.6 KB/sec)
[INFO] 
[INFO] --- maven-clean-plugin:3.0.0:clean (default-clean) @ org.apache.sling.launchpad.testing
---
[INFO] Deleting <https://builds.apache.org/job/sling-org-apache-sling-launchpad-testing-10/ws/target>
[INFO] 
[INFO] --- maven-enforcer-plugin:3.0.0-M1:enforce (enforce-property-values) @ org.apache.sling.launchpad.testing
---
[INFO] 
[INFO] --- maven-enforcer-plugin:3.0.0-M1:enforce (enforce-java) @ org.apache.sling.launchpad.testing
---
[INFO] 
[INFO] --- maven-enforcer-plugin:3.0.0-M1:enforce (ban-maven-scr-plugin) @ org.apache.sling.launchpad.testing
---
[INFO] 
[INFO] --- maven-remote-resources-plugin:1.5:process (process-resource-bundles) @ org.apache.sling.launchpad.testing
---
[INFO] 
[INFO] --- maven-remote-resources-plugin:1.5:process (default) @ org.apache.sling.launchpad.testing
---
[INFO] 
[INFO] --- maven-resources-plugin:2.7:resources (default-resources) @ org.apache.sling.launchpad.testing
---
[INFO] Using 'UTF-8' encoding to copy filtered resources.
[INFO] skip non existing resourceDirectory <https://builds.apache.org/job/sling-org-apache-sling-launchpad-testing-10/ws/src/main/resources>
[INFO] Copying 3 resources
[INFO] Copying 3 resources
[INFO] 
[INFO] --- build-helper-maven-plugin:3.0.0:reserve-network-port (reserve-network-port) @ org.apache.sling.launchpad.testing
---
[INFO] Port assigned41000
[INFO] Reserved port 41000 for http.port
[INFO] Port assigned41001
[INFO] Reserved port 41001 for sling.control.port
[INFO] 
[INFO] --- maven-compiler-plugin:3.7.0:compile (default-compile) @ org.apache.sling.launchpad.testing
---
[INFO] No sources to compile
[INFO] 
[INFO] --- maven-resources-plugin:2.7:testResources (default-testResources) @ org.apache.sling.launchpad.testing
---
[INFO] Using 'UTF-8' encoding to copy filtered resources.
[INFO] Copying 1 resource
[INFO] Copying 3 resources
[INFO] Copying 3 resources
[INFO] 
[INFO] --- maven-compiler-plugin:3.7.0:testCompile (default-testCompile) @ org.apache.sling.launchpad.testing
---
[INFO] No sources to compile
[INFO] 
[INFO] --- maven-surefire-plugin:2.20.1:test (default-test) @ org.apache.sling.launchpad.testing
---
[JENKINS] Recording test results
[INFO] 
[INFO] --- slingstart-maven-plugin:1.7.16:prepare-package (default-prepare-package) @ org.apache.sling.launchpad.testing
---
[INFO] 
[INFO] --- slingstart-maven-plugin:1.7.16:attach-slingfeature (default-attach-slingfeature)
@ org.apache.sling.launchpad.testing ---
[INFO] 
[INFO] --- slingstart-maven-plugin:1.7.16:package (default-package) @ org.apache.sling.launchpad.testing
---
[INFO] Packaging standalone jar...
[INFO] Building zip: <https://builds.apache.org/job/sling-org-apache-sling-launchpad-testing-10/ws/target/org.apache.sling.launchpad.testing-11-SNAPSHOT.jar>
[INFO] 
[INFO] >>> maven-source-plugin:3.0.1:jar (attach-sources) > generate-sources @
org.apache.sling.launchpad.testing >>>
[INFO] 
[INFO] --- maven-enforcer-plugin:3.0.0-M1:enforce (enforce-property-values) @ org.apache.sling.launchpad.testing
---
[INFO] 
[INFO] --- maven-enforcer-plugin:3.0.0-M1:enforce (enforce-java) @ org.apache.sling.launchpad.testing
---
[INFO] 
[INFO] --- maven-enforcer-plugin:3.0.0-M1:enforce (ban-maven-scr-plugin) @ org.apache.sling.launchpad.testing
---
[WARNING] Failed to getClass for org.apache.maven.plugins.source.SourceJarMojo
[INFO] 
[INFO] <<< maven-source-plugin:3.0.1:jar (attach-sources) < generate-sources @
org.apache.sling.launchpad.testing <<<
[INFO] 
[INFO] --- maven-source-plugin:3.0.1:jar (attach-sources) @ org.apache.sling.launchpad.testing
---
[INFO] Building jar: <https://builds.apache.org/job/sling-org-apache-sling-launchpad-testing-10/ws/target/org.apache.sling.launchpad.testing-11-SNAPSHOT-sources.jar>
[INFO] 
[INFO] --- maven-site-plugin:3.5.1:attach-descriptor (attach-descriptor) @ org.apache.sling.launchpad.testing
---
[INFO] 
[INFO] --- slingstart-maven-plugin:1.7.16:start (start-container) @ org.apache.sling.launchpad.testing
---
[INFO] Using launchpad jar being generated as this project's primary artifact: '<https://builds.apache.org/job/sling-org-apache-sling-launchpad-testing-10/ws/target/org.apache.sling.launchpad.testing-11-SNAPSHOT.jar'!>
[INFO] Starting Launchpad _-41000...
-------------------------------------------------------------------
Slingstart application: <https://builds.apache.org/job/sling-org-apache-sling-launchpad-testing-10/ws/target/_-41000/org.apache.sling.launchpad.testing-11-SNAPSHOT.jar>
Main class: org.apache.sling.launchpad.app.Main
Listener Port: 60555
Arguments: [-p, 41000, -j, 41001]
-------------------------------------------------------------------
10.03.2018 12:49:30.838 *INFO * [main] Setting sling.home=sling (default)
10.03.2018 12:49:30.842 *INFO * [main] Starting Apache Sling in <https://builds.apache.org/job/sling-org-apache-sling-launchpad-testing-10/ws/target/_-41000/sling>
10.03.2018 12:49:30.845 *INFO * [main] Sling  Extension Lib Home : <https://builds.apache.org/job/sling-org-apache-sling-launchpad-testing-10/ws/target/_-41000/sling/ext>
10.03.2018 12:49:30.846 *INFO * [main] Checking launcher JAR in folder <https://builds.apache.org/job/sling-org-apache-sling-launchpad-testing-10/ws/target/_-41000/sling>
10.03.2018 12:49:30.858 *INFO * [main] Installing new launcher: jar:<https://builds.apache.org/job/sling-org-apache-sling-launchpad-testing-10/ws/target/_-41000/org.apache.sling.launchpad.testing-11-SNAPSHOT.jar!/resources/org.apache.sling.launchpad.base.jar,>
5.6.10.2_6_26 (org.apache.sling.launchpad.base.jar.1520686170858)
10.03.2018 12:49:30.860 *INFO * [main] Loading launcher class org.apache.sling.launchpad.base.app.MainDelegate
from org.apache.sling.launchpad.base.jar.1520686170858
10.03.2018 12:49:30.860 *INFO * [main] External Libs Home (ext) is null or does not exists.
10.03.2018 12:49:30.878 *INFO * [main] Setting sling.launchpad=<https://builds.apache.org/job/sling-org-apache-sling-launchpad-testing-10/ws/target/_-41000/sling>
10.03.2018 12:49:30.878 *INFO * [main] Setting org.osgi.service.http.port=41000
10.03.2018 12:49:30.878 *INFO * [main] Setting sling.control.socket=41001
10.03.2018 12:49:30.878 *INFO * [main] Starting launcher ...
10.03.2018 12:49:30.889 *INFO * [main] HTTP server port: 41000
WARNING: An illegal reflective access operation has occurred
WARNING: Illegal reflective access by org.apache.felix.framework.ext.ClassPathExtenderFactory$DefaultClassLoaderExtender
(<https://builds.apache.org/job/sling-org-apache-sling-launchpad-testing-10/ws/target/_-41000/sling/org.apache.sling.launchpad.base.jar.1520686170858)>
to method java.net.URLClassLoader.addURL(java.net.URL)
WARNING: Please consider reporting this to the maintainers of org.apache.felix.framework.ext.ClassPathExtenderFactory$DefaultClassLoaderExtender
WARNING: Use --illegal-access=warn to enable warnings of further illegal reflective access
operations
WARNING: All illegal access operations will be denied in a future release
10.03.2018 12:49:31.760 *INFO* [FelixStartLevel] org.apache.sling.commons.logservice Service
[org.apache.sling.commons.logservice.internal.LogServiceFactory,10, [org.osgi.service.log.LogService]]
ServiceEvent REGISTERED
10.03.2018 12:49:31.762 *INFO* [FelixStartLevel] org.apache.sling.commons.logservice Service
[org.apache.sling.commons.logservice.internal.LogReaderServiceFactory,11, [org.osgi.service.log.LogReaderService]]
ServiceEvent REGISTERED
10.03.2018 12:49:31.763 *INFO* [FelixStartLevel] org.apache.sling.commons.logservice BundleEvent
STARTED
10.03.2018 12:49:31.765 *INFO* [FelixStartLevel] org.apache.sling.installer.core BundleEvent
STARTING
10.03.2018 12:49:31.782 *INFO* [FelixStartLevel] org.apache.sling.installer.core Service [Apache
Sling Bundle Install Task Factory,12, [org.apache.sling.installer.api.tasks.InstallTaskFactory]]
ServiceEvent REGISTERED
10.03.2018 12:49:31.783 *INFO* [FelixStartLevel] org.apache.sling.installer.core Service [Apache
Sling Installer - Default Resource Transformer,13, [org.apache.sling.installer.api.tasks.ResourceTransformer]]
ServiceEvent REGISTERED
10.03.2018 12:49:31.785 *INFO* [FelixStartLevel] org.apache.sling.installer.core Service [Apache
Sling Installer Controller Service,14, [org.apache.sling.installer.api.OsgiInstaller, org.apache.sling.installer.api.info.InfoProvider,
org.apache.sling.installer.api.ResourceChangeListener, org.apache.sling.installer.api.tasks.RetryHandler]]
ServiceEvent REGISTERED
10.03.2018 12:49:31.786 *INFO* [OsgiInstallerImpl] org.apache.sling.installer.core.impl.OsgiInstallerImpl
Apache Sling OSGi Installer Service started.
10.03.2018 12:49:31.787 *INFO* [FelixStartLevel] org.apache.sling.installer.core Service [Apache
Sling Installer Controller Service,15, [org.apache.sling.installer.api.jmx.InstallerMBean,
org.apache.sling.installer.api.event.InstallationListener]] ServiceEvent REGISTERED
10.03.2018 12:49:31.788 *INFO* [FelixStartLevel] org.apache.sling.installer.core BundleEvent
STARTED
10.03.2018 12:49:31.795 *INFO* [FelixStartLevel] org.apache.aries.util BundleEvent RESOLVED
10.03.2018 12:49:31.795 *INFO* [FelixStartLevel] org.apache.aries.util BundleEvent STARTING
10.03.2018 12:49:31.795 *INFO* [FelixStartLevel] org.apache.aries.util BundleEvent STARTED
10.03.2018 12:49:31.800 *INFO* [FelixStartLevel] org.apache.felix.eventadmin BundleEvent RESOLVED
10.03.2018 12:49:31.801 *INFO* [FelixStartLevel] org.apache.felix.eventadmin BundleEvent STARTING
10.03.2018 12:49:31.824 *INFO* [FelixStartLevel] org.apache.felix.eventadmin Service [16,
[org.osgi.service.event.EventAdmin]] ServiceEvent REGISTERED
10.03.2018 12:49:31.826 *INFO* [FelixStartLevel] org.apache.felix.eventadmin Service [org.apache.felix.eventadmin.impl.EventAdmin,17,
[org.osgi.service.cm.ManagedService]] ServiceEvent REGISTERED
10.03.2018 12:49:31.827 *INFO* [FelixStartLevel] org.apache.felix.eventadmin BundleEvent STARTED
10.03.2018 12:49:31.836 *INFO* [FelixStartLevel] org.apache.sling.installer.factory.configuration
BundleEvent RESOLVED
10.03.2018 12:49:31.842 *INFO* [FelixStartLevel] org.apache.sling.installer.factory.configuration
BundleEvent STARTING
10.03.2018 12:49:31.864 *INFO* [FelixStartLevel] org.apache.sling.installer.factory.configuration
Service [Apache Sling Configuration Install Task Factory,18, [org.apache.sling.installer.api.tasks.InstallTaskFactory,
org.osgi.service.cm.ConfigurationListener, org.apache.sling.installer.api.tasks.ResourceTransformer]]
ServiceEvent REGISTERED
10.03.2018 12:49:31.865 *INFO* [FelixStartLevel] org.apache.sling.installer.factory.configuration
BundleEvent STARTED
10.03.2018 12:49:31.869 *INFO* [FelixStartLevel] jcl.over.slf4j BundleEvent RESOLVED
10.03.2018 12:49:31.870 *INFO* [FelixStartLevel] jcl.over.slf4j BundleEvent STARTING
10.03.2018 12:49:31.870 *INFO* [FelixStartLevel] jcl.over.slf4j BundleEvent STARTED
10.03.2018 12:49:31.874 *INFO* [FelixStartLevel] org.apache.sling.javax.activation BundleEvent
RESOLVED
10.03.2018 12:49:31.879 *INFO* [FelixStartLevel] org.apache.sling.javax.activation BundleEvent
STARTING
10.03.2018 12:49:31.887 *INFO* [FelixStartLevel] org.apache.sling.javax.activation BundleEvent
STARTED
10.03.2018 12:49:31.897 *INFO* [FelixStartLevel] org.apache.sling.launchpad.installer BundleEvent
RESOLVED
10.03.2018 12:49:31.899 *INFO* [FelixStartLevel] org.apache.sling.launchpad.installer BundleEvent
STARTING
10.03.2018 12:49:31.902 *INFO* [FelixStartLevel] org.apache.sling.launchpad.installer BundleEvent
STARTED
10.03.2018 12:49:31.903 *INFO* [FelixStartLevel] org.apache.sling.commons.log BundleEvent
STARTING
10.03.2018 12:49:31.926 *INFO* [FelixStartLevel] org.apache.sling.commons.log Service [org.apache.sling.commons.log.LogManager,19,
[org.osgi.service.cm.ManagedService]] ServiceEvent REGISTERED
10.03.2018 12:49:31.927 *INFO* [FelixStartLevel] org.apache.sling.commons.log Service [org.apache.sling.commons.log.LogManager.factory.writer,20,
[org.osgi.service.cm.ManagedServiceFactory]] ServiceEvent REGISTERED
10.03.2018 12:49:31.928 *INFO* [FelixStartLevel] org.apache.sling.commons.log Service [org.apache.sling.commons.log.LogManager.factory.config,21,
[org.osgi.service.cm.ManagedServiceFactory]] ServiceEvent REGISTERED
10.03.2018 12:49:31.933 *INFO* [FelixStartLevel] org.apache.sling.commons.log Service [Sling
Log Panel Support,22, [org.apache.sling.commons.log.logback.webconsole.LogPanel]] ServiceEvent
REGISTERED
10.03.2018 12:49:31.935 *INFO* [FelixStartLevel] org.apache.sling.commons.log Service [Sling
Log Configuration Printer,23, [org.apache.sling.commons.log.logback.internal.SlingConfigurationPrinter]]
ServiceEvent REGISTERED
10.03.2018 12:49:31.939 *INFO* [FelixStartLevel] org.apache.sling.commons.log Service [Sling
Log Reset Event Handler,24, [org.osgi.service.event.EventHandler]] ServiceEvent REGISTERED
10.03.2018 12:49:32.330 *INFO * [main] Startup completed
10.03.2018 12:49:32.962 *INFO* [OsgiInstallerImpl] org.apache.sling.audit.osgi.installer Installed
configuration org.apache.sling.jcr.webdav.impl.servlets.SimpleWebDavServlet from resource
TaskResource(url=launchpad:resources/config/org.apache.sling.jcr.webdav.impl.servlets.SimpleWebDavServlet.config,
entity=config:org.apache.sling.jcr.webdav.impl.servlets.SimpleWebDavServlet, state=INSTALL,
attributes=[org.apache.sling.installer.api.tasks.ResourceTransformer=:18:, service.pid=org.apache.sling.jcr.webdav.impl.servlets.SimpleWebDavServlet],
digest=40b06a2412e7e842f149163de5a9ae75)
[INFO] Started Launchpad '_-41000' at port 41000 [run modes: null]
[INFO] 
[INFO] --- maven-failsafe-plugin:2.20.1:integration-test (default) @ org.apache.sling.launchpad.testing
---
[JENKINS] Recording test results
Mar 10, 2018 12:49:36 PM org.apache.tika.config.InitializableProblemHandler$3 handleInitializableProblem
WARNING: JBIG2ImageReader not loaded. jbig2 files will be ignored
See https://pdfbox.apache.org/2.0/dependencies.html#jai-image-io
for optional dependencies.
TIFFImageWriter not loaded. tiff files will not be processed
See https://pdfbox.apache.org/2.0/dependencies.html#jai-image-io
for optional dependencies.
J2KImageReader not loaded. JPEG2000 files will not be processed.
See https://pdfbox.apache.org/2.0/dependencies.html#jai-image-io
for optional dependencies.

Mar 10, 2018 12:49:36 PM org.apache.tika.config.InitializableProblemHandler$3 handleInitializableProblem
WARNING: org.xerial's sqlite-jdbc is not loaded.
Please provide the jar on your classpath to parse sqlite files.
See tika-parsers/pom.xml for the correct version.
[JENKINS] Archiving disabled
[JENKINS] Archiving disabled
[INFO] ------------------------------------------------------------------------
[INFO] BUILD FAILURE
[INFO] ------------------------------------------------------------------------
[INFO] Total time: 01:12 min
[INFO] Finished at: 2018-03-10T12:49:40+00:00
[INFO] Final Memory: 42M/256M
[INFO] ------------------------------------------------------------------------
Waiting for Jenkins to finish collecting data
[ERROR] Failed to execute goal org.apache.maven.plugins:maven-failsafe-plugin:2.20.1:integration-test
(default) on project org.apache.sling.launchpad.testing: Execution default of goal org.apache.maven.plugins:maven-failsafe-plugin:2.20.1:integration-test
failed. NullPointerException -> [Help 1]
[ERROR] 
[ERROR] To see the full stack trace of the errors, re-run Maven with the -e switch.
[ERROR] Re-run Maven using the -X switch to enable full debug logging.
[ERROR] 
[ERROR] For more information about the errors and possible solutions, please read the following
articles:
[ERROR] [Help 1] http://cwiki.apache.org/confluence/display/MAVEN/PluginExecutionException
channel stopped
Terminating launchpad _-41000
10.03.2018 12:49:47.327 *INFO * [Apache Sling Terminator] Java VM is shutting down
10.03.2018 12:49:47.328 *INFO * [Apache Sling Terminator] Stopping Apache Sling
Archiving artifacts
ERROR: Failed to archive {target/_-41000/sling/logs/request.log=target/_-41000/sling/logs/request.log,
target/_-41000/sling/logs/access.log=target/_-41000/sling/logs/access.log, target/_-41000/sling/logs/error.log=target/_-41000/sling/logs/error.log}
due to internal error; falling back to full archiving
java.lang.IllegalStateException: checksum mismatch after transfer (3544383691292553776 vs.
1937255242); /x1/jenkins/jenkins-home/jobs/sling-org-apache-sling-launchpad-testing-10/builds/35/archive/target/_-41000/sling/logs/error.log
may be corrupted
	at jsync.protocol.FileSequenceReader.read(FileSequenceReader.java:45)
	at com.cloudbees.jenkins.plugins.jsync.archiver.JSyncArtifactManager.remoteSync(JSyncArtifactManager.java:158)
	at com.cloudbees.jenkins.plugins.jsync.archiver.JSyncArtifactManager.archive(JSyncArtifactManager.java:76)
	at hudson.tasks.ArtifactArchiver.perform(ArtifactArchiver.java:245)
	at hudson.tasks.BuildStepCompatibilityLayer.perform(BuildStepCompatibilityLayer.java:81)
	at hudson.tasks.BuildStepMonitor$1.perform(BuildStepMonitor.java:20)
	at hudson.model.AbstractBuild$AbstractBuildExecution.perform(AbstractBuild.java:744)
	at hudson.model.AbstractBuild$AbstractBuildExecution.performAllBuildSteps(AbstractBuild.java:690)
	at hudson.maven.MavenModuleSetBuild$MavenModuleSetBuildExecution.post2(MavenModuleSetBuild.java:1073)
	at hudson.model.AbstractBuild$AbstractBuildExecution.post(AbstractBuild.java:635)
	at hudson.model.Run.execute(Run.java:1749)
	at hudson.maven.MavenModuleSetBuild.run(MavenModuleSetBuild.java:543)
	at hudson.model.ResourceController.execute(ResourceController.java:97)
	at hudson.model.Executor.run(Executor.java:429)
Recording test results

Mime
View raw message