sling-commits mailing list archives

Site index · List index
Message view « Date » · « Thread »
Top « Date » · « Thread »
From Apache Jenkins Server <jenk...@builds.apache.org>
Subject Build failed in Jenkins: sling-org-apache-sling-scripting-sightly-testing-content-1.8 #21
Date Sun, 04 Mar 2018 06:34:26 GMT
See <https://builds.apache.org/job/sling-org-apache-sling-scripting-sightly-testing-content-1.8/21/display/redirect>

------------------------------------------
Started by timer
[EnvInject] - Loading node environment variables.
Building remotely on ubuntu-4 (ubuntu trusty) in workspace <https://builds.apache.org/job/sling-org-apache-sling-scripting-sightly-testing-content-1.8/ws/>
 > git rev-parse --is-inside-work-tree # timeout=10
Fetching changes from the remote Git repository
 > git config remote.origin.url https://github.com/apache/sling-org-apache-sling-scripting-sightly-testing-content.git
# timeout=10
Fetching upstream changes from https://github.com/apache/sling-org-apache-sling-scripting-sightly-testing-content.git
 > git --version # timeout=10
 > git fetch --tags --progress https://github.com/apache/sling-org-apache-sling-scripting-sightly-testing-content.git
+refs/heads/*:refs/remotes/origin/*
 > git rev-parse origin/master^{commit} # timeout=10
Checking out Revision cf3a27d4093b5bd8da611fe34933a882854407ab (origin/master)
 > git config core.sparsecheckout # timeout=10
 > git checkout -f cf3a27d4093b5bd8da611fe34933a882854407ab
Commit message: "[maven-release-plugin] prepare for next development iteration"
 > git rev-list --no-walk cf3a27d4093b5bd8da611fe34933a882854407ab # timeout=10
Parsing POMs
Established TCP socket on 36461
maven33-agent.jar already up to date
maven33-interceptor.jar already up to date
maven3-interceptor-commons.jar already up to date
[sling-org-apache-sling-scripting-sightly-testing-content-1.8] $ /home/jenkins/tools/java/latest1.8/bin/java
-Xmx2g -Xms256m -cp /home/jenkins/jenkins-slave/maven33-agent.jar:/home/jenkins/tools/maven/apache-maven-3.3.9/boot/plexus-classworlds-2.5.2.jar:/home/jenkins/tools/maven/apache-maven-3.3.9/conf/logging
jenkins.maven3.agent.Maven33Main /home/jenkins/tools/maven/apache-maven-3.3.9 /home/jenkins/jenkins-slave/slave.jar
/home/jenkins/jenkins-slave/maven33-interceptor.jar /home/jenkins/jenkins-slave/maven3-interceptor-commons.jar
36461
<===[JENKINS REMOTING CAPACITY]===>   channel started
Executing Maven:  -B -f <https://builds.apache.org/job/sling-org-apache-sling-scripting-sightly-testing-content-1.8/ws/pom.xml>
-Dmaven.repo.local=/home/jenkins/jenkins-slave/maven-repositories/0 -U clean deploy
[INFO] Scanning for projects...
[INFO]                                                                         
[INFO] ------------------------------------------------------------------------
[INFO] Building Apache Sling Scripting HTL Integration Tests Content 1.0.9-1.3.1-SNAPSHOT
[INFO] ------------------------------------------------------------------------
[INFO] Downloading: https://oss.sonatype.org/content/repositories/snapshots/org/apache/sling/org.apache.sling.scripting.sightly.compiler.java/1.0.23-1.3.1-SNAPSHOT/maven-metadata.xml
[INFO] Downloading: http://repository.apache.org/snapshots/org/apache/sling/org.apache.sling.scripting.sightly.compiler.java/1.0.23-1.3.1-SNAPSHOT/maven-metadata.xml
[INFO] Downloading: https://oss.sonatype.org/content/repositories/snapshots/org/apache/sling/org.apache.sling.scripting.sightly.compiler.java/1.0.23-1.3.1-SNAPSHOT/org.apache.sling.scripting.sightly.compiler.java-1.0.23-1.3.1-SNAPSHOT.pom
[INFO] Downloading: http://repository.apache.org/snapshots/org/apache/sling/org.apache.sling.scripting.sightly.compiler.java/1.0.23-1.3.1-SNAPSHOT/org.apache.sling.scripting.sightly.compiler.java-1.0.23-1.3.1-SNAPSHOT.pom
[WARNING] The POM for org.apache.sling:org.apache.sling.scripting.sightly.compiler.java:jar:1.0.23-1.3.1-SNAPSHOT
is missing, no dependency information available
[INFO] Downloading: https://oss.sonatype.org/content/repositories/snapshots/org/apache/sling/org.apache.sling.scripting.sightly/1.0.49-1.3.1-SNAPSHOT/maven-metadata.xml
[INFO] Downloading: http://repository.apache.org/snapshots/org/apache/sling/org.apache.sling.scripting.sightly/1.0.49-1.3.1-SNAPSHOT/maven-metadata.xml
[INFO] Downloading: https://oss.sonatype.org/content/repositories/snapshots/org/apache/sling/org.apache.sling.scripting.sightly/1.0.49-1.3.1-SNAPSHOT/org.apache.sling.scripting.sightly-1.0.49-1.3.1-SNAPSHOT.pom
[INFO] Downloading: http://repository.apache.org/snapshots/org/apache/sling/org.apache.sling.scripting.sightly/1.0.49-1.3.1-SNAPSHOT/org.apache.sling.scripting.sightly-1.0.49-1.3.1-SNAPSHOT.pom
[WARNING] The POM for org.apache.sling:org.apache.sling.scripting.sightly:jar:1.0.49-1.3.1-SNAPSHOT
is missing, no dependency information available
[INFO] Downloading: https://oss.sonatype.org/content/repositories/snapshots/org/apache/sling/org.apache.sling.scripting.sightly.compiler.java/1.0.23-1.3.1-SNAPSHOT/org.apache.sling.scripting.sightly.compiler.java-1.0.23-1.3.1-SNAPSHOT.jar
[INFO] Downloading: https://oss.sonatype.org/content/repositories/snapshots/org/apache/sling/org.apache.sling.scripting.sightly/1.0.49-1.3.1-SNAPSHOT/org.apache.sling.scripting.sightly-1.0.49-1.3.1-SNAPSHOT.jar
[INFO] Downloading: http://repository.apache.org/snapshots/org/apache/sling/org.apache.sling.scripting.sightly.compiler.java/1.0.23-1.3.1-SNAPSHOT/org.apache.sling.scripting.sightly.compiler.java-1.0.23-1.3.1-SNAPSHOT.jar
[INFO] Downloading: http://repository.apache.org/snapshots/org/apache/sling/org.apache.sling.scripting.sightly/1.0.49-1.3.1-SNAPSHOT/org.apache.sling.scripting.sightly-1.0.49-1.3.1-SNAPSHOT.jar
[JENKINS] Archiving disabled
[JENKINS] Archiving disabled
[INFO] ------------------------------------------------------------------------
[INFO] BUILD FAILURE
[INFO] ------------------------------------------------------------------------
[INFO] Total time: 10.524 s
[INFO] Finished at: 2018-03-04T06:34:23+00:00
[INFO] Final Memory: 24M/309M
[INFO] ------------------------------------------------------------------------
[ERROR] Failed to execute goal on project org.apache.sling.scripting.sightly.testing-content:
Could not resolve dependencies for project org.apache.sling:org.apache.sling.scripting.sightly.testing-content:bundle:1.0.9-1.3.1-SNAPSHOT:
The following artifacts could not be resolved: org.apache.sling:org.apache.sling.scripting.sightly.compiler.java:jar:1.0.23-1.3.1-SNAPSHOT,
org.apache.sling:org.apache.sling.scripting.sightly:jar:1.0.49-1.3.1-SNAPSHOT: Could not find
artifact org.apache.sling:org.apache.sling.scripting.sightly.compiler.java:jar:1.0.23-1.3.1-SNAPSHOT
in oss-sonatype (https://oss.sonatype.org/content/repositories/snapshots) -> [Help 1]
[ERROR] 
[ERROR] To see the full stack trace of the errors, re-run Maven with the -e switch.
[ERROR] Re-run Maven using the -X switch to enable full debug logging.
[ERROR] 
[ERROR] For more information about the errors and possible solutions, please read the following
articles:
[ERROR] [Help 1] http://cwiki.apache.org/confluence/display/MAVEN/DependencyResolutionException
channel stopped
Recording test results

Mime
View raw message