sling-commits mailing list archives

Site index · List index
Message view « Date » · « Thread »
Top « Date » · « Thread »
From Apache Jenkins Server <jenk...@builds.apache.org>
Subject Build failed in Jenkins: sling-org-apache-sling-karaf-integration-tests-1.8 #98
Date Sat, 17 Mar 2018 23:05:21 GMT
See <https://builds.apache.org/job/sling-org-apache-sling-karaf-integration-tests-1.8/98/display/redirect?page=changes>

Changes:

[olli] remove version properties

[olli] decouple versions

[olli] SLING-3017 Improve Karaf integration tests

------------------------------------------
Started by upstream project "sling-org-apache-sling-karaf-features-1.8" build number 61
originally caused by:
 Started by an SCM change
[EnvInject] - Loading node environment variables.
Building remotely on H30 (ubuntu xenial) in workspace <https://builds.apache.org/job/sling-org-apache-sling-karaf-integration-tests-1.8/ws/>
Cloning the remote Git repository
Cloning repository https://github.com/apache/sling-org-apache-sling-karaf-integration-tests.git
 > git init <https://builds.apache.org/job/sling-org-apache-sling-karaf-integration-tests-1.8/ws/>
# timeout=10
Fetching upstream changes from https://github.com/apache/sling-org-apache-sling-karaf-integration-tests.git
 > git --version # timeout=10
 > git fetch --tags --progress https://github.com/apache/sling-org-apache-sling-karaf-integration-tests.git
+refs/heads/*:refs/remotes/origin/*
 > git config remote.origin.url https://github.com/apache/sling-org-apache-sling-karaf-integration-tests.git
# timeout=10
 > git config --add remote.origin.fetch +refs/heads/*:refs/remotes/origin/* # timeout=10
 > git config remote.origin.url https://github.com/apache/sling-org-apache-sling-karaf-integration-tests.git
# timeout=10
Fetching upstream changes from https://github.com/apache/sling-org-apache-sling-karaf-integration-tests.git
 > git fetch --tags --progress https://github.com/apache/sling-org-apache-sling-karaf-integration-tests.git
+refs/heads/*:refs/remotes/origin/*
 > git rev-parse origin/master^{commit} # timeout=10
Checking out Revision 7f67cdae2f495d216dd35ffc8180c85b72139001 (origin/master)
 > git config core.sparsecheckout # timeout=10
 > git checkout -f 7f67cdae2f495d216dd35ffc8180c85b72139001
Commit message: "SLING-3017 Improve Karaf integration tests"
 > git rev-list --no-walk f2b8f63972ecec36a2a7a74959ddd63a109e20c9 # timeout=10
Parsing POMs
Modules changed, recalculating dependency graph
Established TCP socket on 42547
maven33-agent.jar already up to date
maven33-interceptor.jar already up to date
maven3-interceptor-commons.jar already up to date
[sling-org-apache-sling-karaf-integration-tests-1.8] $ /home/jenkins/tools/java/latest1.8/bin/java
-Xmx2g -Xms256m -cp /home/jenkins/jenkins-slave/maven33-agent.jar:/home/jenkins/tools/maven/apache-maven-3.3.9/boot/plexus-classworlds-2.5.2.jar:/home/jenkins/tools/maven/apache-maven-3.3.9/conf/logging
jenkins.maven3.agent.Maven33Main /home/jenkins/tools/maven/apache-maven-3.3.9 /home/jenkins/jenkins-slave/slave.jar
/home/jenkins/jenkins-slave/maven33-interceptor.jar /home/jenkins/jenkins-slave/maven3-interceptor-commons.jar
42547
<===[JENKINS REMOTING CAPACITY]===>   channel started
Executing Maven:  -B -f <https://builds.apache.org/job/sling-org-apache-sling-karaf-integration-tests-1.8/ws/pom.xml>
-Dmaven.repo.local=/home/jenkins/jenkins-slave/maven-repositories/0 -U clean deploy
[INFO] Scanning for projects...
[INFO]                                                                         
[INFO] ------------------------------------------------------------------------
[INFO] Building Apache Sling - Karaf Integration Tests 0.1.1-SNAPSHOT
[INFO] ------------------------------------------------------------------------
[INFO] Downloading: https://repo.maven.apache.org/maven2/org/apache/sling/org.apache.sling.api/2.18.0/org.apache.sling.api-2.18.0.pom
[WARNING] The POM for org.apache.sling:org.apache.sling.api:jar:2.18.0 is missing, no dependency
information available
[INFO] Downloading: http://repository.apache.org/snapshots/org/apache/sling/org.apache.sling.commons.messaging/0.0.1-SNAPSHOT/maven-metadata.xml
[INFO] Downloaded: http://repository.apache.org/snapshots/org/apache/sling/org.apache.sling.commons.messaging/0.0.1-SNAPSHOT/maven-metadata.xml
(1018 B at 3.2 KB/sec)
[INFO] Downloading: http://repository.apache.org/snapshots/org/apache/sling/org.apache.sling.commons.messaging/0.0.1-SNAPSHOT/org.apache.sling.commons.messaging-0.0.1-20180317.062313-33.pom
[INFO] Downloaded: http://repository.apache.org/snapshots/org/apache/sling/org.apache.sling.commons.messaging/0.0.1-SNAPSHOT/org.apache.sling.commons.messaging-0.0.1-20180317.062313-33.pom
(3 KB at 9.1 KB/sec)
[INFO] Downloading: http://repository.apache.org/snapshots/org/apache/sling/org.apache.sling.karaf-features/0.1.1-SNAPSHOT/maven-metadata.xml
[INFO] Downloaded: http://repository.apache.org/snapshots/org/apache/sling/org.apache.sling.karaf-features/0.1.1-SNAPSHOT/maven-metadata.xml
(2 KB at 3.5 KB/sec)
[INFO] Downloading: http://repository.apache.org/snapshots/org/apache/sling/org.apache.sling.karaf-features/0.1.1-SNAPSHOT/org.apache.sling.karaf-features-0.1.1-20180317.230249-123.pom
[INFO] Downloaded: http://repository.apache.org/snapshots/org/apache/sling/org.apache.sling.karaf-features/0.1.1-SNAPSHOT/org.apache.sling.karaf-features-0.1.1-20180317.230249-123.pom
(3 KB at 9.7 KB/sec)
[INFO] Downloading: http://repository.apache.org/snapshots/org/apache/sling/org.apache.sling.karaf-configs/0.1.1-SNAPSHOT/maven-metadata.xml
[INFO] Downloaded: http://repository.apache.org/snapshots/org/apache/sling/org.apache.sling.karaf-configs/0.1.1-SNAPSHOT/maven-metadata.xml
(12 KB at 37.3 KB/sec)
[INFO] Downloading: http://repository.apache.org/snapshots/org/apache/sling/org.apache.sling.karaf-configs/0.1.1-SNAPSHOT/org.apache.sling.karaf-configs-0.1.1-20180317.230459-50.pom
[INFO] Downloaded: http://repository.apache.org/snapshots/org/apache/sling/org.apache.sling.karaf-configs/0.1.1-SNAPSHOT/org.apache.sling.karaf-configs-0.1.1-20180317.230459-50.pom
(15 KB at 50.0 KB/sec)
[INFO] Downloading: https://repo.maven.apache.org/maven2/net/java/dev/jna/jna/4.5.1/jna-4.5.1.pom
[INFO] Downloaded: https://repo.maven.apache.org/maven2/net/java/dev/jna/jna/4.5.1/jna-4.5.1.pom
(2 KB at 48.2 KB/sec)
[INFO] Downloading: https://repo.maven.apache.org/maven2/net/java/dev/jna/jna-platform/4.5.1/jna-platform-4.5.1.pom
[INFO] Downloaded: https://repo.maven.apache.org/maven2/net/java/dev/jna/jna-platform/4.5.1/jna-platform-4.5.1.pom
(2 KB at 103.4 KB/sec)
[INFO] Downloading: https://repo.maven.apache.org/maven2/com/couchbase/mock/CouchbaseMock/1.5.14/CouchbaseMock-1.5.14.pom
[INFO] Downloaded: https://repo.maven.apache.org/maven2/com/couchbase/mock/CouchbaseMock/1.5.14/CouchbaseMock-1.5.14.pom
(7 KB at 69.5 KB/sec)
[INFO] Downloading: https://repo.maven.apache.org/maven2/org/apache/servicemix/bundles/org.apache.servicemix.bundles.rhino/1.7.8_1/org.apache.servicemix.bundles.rhino-1.7.8_1.pom
[INFO] Downloaded: https://repo.maven.apache.org/maven2/org/apache/servicemix/bundles/org.apache.servicemix.bundles.rhino/1.7.8_1/org.apache.servicemix.bundles.rhino-1.7.8_1.pom
(3 KB at 16.7 KB/sec)
[INFO] Downloading: https://repo.maven.apache.org/maven2/org/apache/sling/org.apache.sling.api/2.18.0/org.apache.sling.api-2.18.0.jar
[INFO] Downloading: https://repo.maven.apache.org/maven2/net/java/dev/jna/jna/4.5.1/jna-4.5.1.jar
[INFO] Downloading: https://repo.maven.apache.org/maven2/net/java/dev/jna/jna-platform/4.5.1/jna-platform-4.5.1.jar
[INFO] Downloading: https://repo.maven.apache.org/maven2/com/couchbase/mock/CouchbaseMock/1.5.14/CouchbaseMock-1.5.14.jar
[INFO] Downloading: https://repo.maven.apache.org/maven2/org/apache/servicemix/bundles/org.apache.servicemix.bundles.rhino/1.7.8_1/org.apache.servicemix.bundles.rhino-1.7.8_1.jar
[INFO] Downloaded: https://repo.maven.apache.org/maven2/net/java/dev/jna/jna/4.5.1/jna-4.5.1.jar
(1407 KB at 7564.0 KB/sec)
[INFO] Downloaded: https://repo.maven.apache.org/maven2/org/apache/servicemix/bundles/org.apache.servicemix.bundles.rhino/1.7.8_1/org.apache.servicemix.bundles.rhino-1.7.8_1.jar
(2119 KB at 9129.7 KB/sec)
[INFO] Downloaded: https://repo.maven.apache.org/maven2/net/java/dev/jna/jna-platform/4.5.1/jna-platform-4.5.1.jar
(2273 KB at 8449.8 KB/sec)
[INFO] Downloaded: https://repo.maven.apache.org/maven2/com/couchbase/mock/CouchbaseMock/1.5.14/CouchbaseMock-1.5.14.jar
(3728 KB at 10074.1 KB/sec)
[INFO] Downloading: http://repository.apache.org/snapshots/org/apache/sling/org.apache.sling.commons.messaging/0.0.1-SNAPSHOT/org.apache.sling.commons.messaging-0.0.1-20180317.062313-33.jar
[INFO] Downloading: http://repository.apache.org/snapshots/org/apache/sling/org.apache.sling.karaf-features/0.1.1-SNAPSHOT/org.apache.sling.karaf-features-0.1.1-20180317.230249-123-features.xml
[INFO] Downloading: http://repository.apache.org/snapshots/org/apache/sling/org.apache.sling.karaf-configs/0.1.1-SNAPSHOT/org.apache.sling.karaf-configs-0.1.1-20180317.230459-50.jar
[INFO] Downloaded: http://repository.apache.org/snapshots/org/apache/sling/org.apache.sling.commons.messaging/0.0.1-SNAPSHOT/org.apache.sling.commons.messaging-0.0.1-20180317.062313-33.jar
(10 KB at 30.7 KB/sec)
[INFO] Downloaded: http://repository.apache.org/snapshots/org/apache/sling/org.apache.sling.karaf-configs/0.1.1-SNAPSHOT/org.apache.sling.karaf-configs-0.1.1-20180317.230459-50.jar
(21 KB at 54.4 KB/sec)
[INFO] Downloaded: http://repository.apache.org/snapshots/org/apache/sling/org.apache.sling.karaf-features/0.1.1-SNAPSHOT/org.apache.sling.karaf-features-0.1.1-20180317.230249-123-features.xml
(44 KB at 99.8 KB/sec)
[JENKINS] Archiving disabled
[JENKINS] Archiving disabled
[INFO] ------------------------------------------------------------------------
[INFO] BUILD FAILURE
[INFO] ------------------------------------------------------------------------
[INFO] Total time: 12.995 s
[INFO] Finished at: 2018-03-17T23:05:18+00:00
[INFO] Final Memory: 17M/290M
[INFO] ------------------------------------------------------------------------
Waiting for Jenkins to finish collecting data
[ERROR] Failed to execute goal on project org.apache.sling.karaf-integration-tests: Could
not resolve dependencies for project org.apache.sling:org.apache.sling.karaf-integration-tests:jar:0.1.1-SNAPSHOT:
Could not find artifact org.apache.sling:org.apache.sling.api:jar:2.18.0 in central (https://repo.maven.apache.org/maven2)
-> [Help 1]
[ERROR] 
[ERROR] To see the full stack trace of the errors, re-run Maven with the -e switch.
[ERROR] Re-run Maven using the -X switch to enable full debug logging.
[ERROR] 
[ERROR] For more information about the errors and possible solutions, please read the following
articles:
[ERROR] [Help 1] http://cwiki.apache.org/confluence/display/MAVEN/DependencyResolutionException
channel stopped
Recording test results

Mime
View raw message