sling-commits mailing list archives

Site index · List index
Message view « Date » · « Thread »
Top « Date » · « Thread »
From Apache Jenkins Server <jenk...@builds.apache.org>
Subject Build failed in Jenkins: sling-org-apache-sling-launchpad-testing-10 #37
Date Mon, 12 Mar 2018 06:28:16 GMT
See <https://builds.apache.org/job/sling-org-apache-sling-launchpad-testing-10/37/display/redirect>

------------------------------------------
Started by upstream project "sling-org-apache-sling-launchpad-integration-tests-1.8" build
number 47
originally caused by:
 Started by upstream project "sling-org-apache-sling-launchpad-test-services-1.8" build number
20
 originally caused by:
  Started by timer
[EnvInject] - Loading node environment variables.
Building remotely on H27 (ubuntu xenial) in workspace <https://builds.apache.org/job/sling-org-apache-sling-launchpad-testing-10/ws/>
 > git rev-parse --is-inside-work-tree # timeout=10
Fetching changes from the remote Git repository
 > git config remote.origin.url https://github.com/apache/sling-org-apache-sling-launchpad-testing.git
# timeout=10
Fetching upstream changes from https://github.com/apache/sling-org-apache-sling-launchpad-testing.git
 > git --version # timeout=10
 > git fetch --tags --progress https://github.com/apache/sling-org-apache-sling-launchpad-testing.git
+refs/heads/*:refs/remotes/origin/*
 > git rev-parse origin/master^{commit} # timeout=10
Checking out Revision 8325d11b2c094ab9fef235abc07e6f1c7c915f50 (origin/master)
 > git config core.sparsecheckout # timeout=10
 > git checkout -f 8325d11b2c094ab9fef235abc07e6f1c7c915f50
Commit message: "SLING-7353 Update to Sling Parent 33"
 > git rev-list --no-walk 8325d11b2c094ab9fef235abc07e6f1c7c915f50 # timeout=10
Parsing POMs
Established TCP socket on 42952
maven33-agent.jar already up to date
maven33-interceptor.jar already up to date
maven3-interceptor-commons.jar already up to date
[sling-org-apache-sling-launchpad-testing-10] $ /home/jenkins/tools/java/jdk-10-ea+36/bin/java
-Xmx2g -Xms256m -cp /home/jenkins/jenkins-slave/maven33-agent.jar:/home/jenkins/tools/maven/apache-maven-3.3.9/boot/plexus-classworlds-2.5.2.jar:/home/jenkins/tools/maven/apache-maven-3.3.9/conf/logging
jenkins.maven3.agent.Maven33Main /home/jenkins/tools/maven/apache-maven-3.3.9 /home/jenkins/jenkins-slave/slave.jar
/home/jenkins/jenkins-slave/maven33-interceptor.jar /home/jenkins/jenkins-slave/maven3-interceptor-commons.jar
42952
<===[JENKINS REMOTING CAPACITY]===>   channel started
WARNING: An illegal reflective access operation has occurred
WARNING: Illegal reflective access by hudson.remoting.RemoteClassLoader (file:/home/jenkins/jenkins-slave/slave.jar)
to method java.lang.ClassLoader.getClassLoadingLock(java.lang.String)
WARNING: Please consider reporting this to the maintainers of hudson.remoting.RemoteClassLoader
WARNING: Use --illegal-access=warn to enable warnings of further illegal reflective access
operations
WARNING: All illegal access operations will be denied in a future release
Executing Maven:  -B -f <https://builds.apache.org/job/sling-org-apache-sling-launchpad-testing-10/ws/pom.xml>
-Dmaven.repo.local=/home/jenkins/jenkins-slave/maven-repositories/1 -U clean verify
[INFO] Scanning for projects...
[INFO] Downloading: http://repository.apache.org/snapshots/org/apache/sling/org.apache.sling.launchpad.test-bundles/0.0.5-SNAPSHOT/maven-metadata.xml
[INFO] Downloaded: http://repository.apache.org/snapshots/org/apache/sling/org.apache.sling.launchpad.test-bundles/0.0.5-SNAPSHOT/maven-metadata.xml
(1023 B at 2.4 KB/sec)
[INFO] Downloading: http://repository.apache.org/snapshots/org/apache/sling/org.apache.sling.launchpad.test-bundles/0.0.5-SNAPSHOT/org.apache.sling.launchpad.test-bundles-0.0.5-20180306.224939-11.txt
[INFO] Downloaded: http://repository.apache.org/snapshots/org/apache/sling/org.apache.sling.launchpad.test-bundles/0.0.5-SNAPSHOT/org.apache.sling.launchpad.test-bundles-0.0.5-20180306.224939-11.txt
(2 KB at 5.1 KB/sec)
[INFO] Downloading: http://repository.apache.org/snapshots/org/apache/sling/org.apache.sling.starter/11-SNAPSHOT/maven-metadata.xml
[INFO] Downloaded: http://repository.apache.org/snapshots/org/apache/sling/org.apache.sling.starter/11-SNAPSHOT/maven-metadata.xml
(2 KB at 4.5 KB/sec)
[INFO] Downloading: http://repository.apache.org/snapshots/org/apache/sling/org.apache.sling.starter/11-SNAPSHOT/org.apache.sling.starter-11-20180310.065852-21-slingfeature.txt
[INFO] Downloaded: http://repository.apache.org/snapshots/org/apache/sling/org.apache.sling.starter/11-SNAPSHOT/org.apache.sling.starter-11-20180310.065852-21-slingfeature.txt
(31 KB at 91.3 KB/sec)
[INFO] Extended Maven classpath (scope 'provided') by the dependencies extracted from the
Sling model.
[INFO]                                                                         
[INFO] ------------------------------------------------------------------------
[INFO] Building Apache Sling Launchpad Testing 11-SNAPSHOT
[INFO] ------------------------------------------------------------------------
[INFO] Downloading: http://repository.apache.org/snapshots/org/apache/sling/org.apache.sling.launchpad.integration-tests/1.0.7-SNAPSHOT/maven-metadata.xml
[INFO] Downloaded: http://repository.apache.org/snapshots/org/apache/sling/org.apache.sling.launchpad.integration-tests/1.0.7-SNAPSHOT/maven-metadata.xml
(2 KB at 3.3 KB/sec)
[INFO] Downloading: http://repository.apache.org/snapshots/org/apache/sling/org.apache.sling.launchpad.integration-tests/1.0.7-SNAPSHOT/org.apache.sling.launchpad.integration-tests-1.0.7-20180312.062603-26.pom
[INFO] Downloaded: http://repository.apache.org/snapshots/org/apache/sling/org.apache.sling.launchpad.integration-tests/1.0.7-SNAPSHOT/org.apache.sling.launchpad.integration-tests-1.0.7-20180312.062603-26.pom
(12 KB at 37.3 KB/sec)
[INFO] Downloading: http://repository.apache.org/snapshots/org/apache/sling/org.apache.sling.junit.teleporter/1.0.17-SNAPSHOT/maven-metadata.xml
[INFO] Downloaded: http://repository.apache.org/snapshots/org/apache/sling/org.apache.sling.junit.teleporter/1.0.17-SNAPSHOT/maven-metadata.xml
(1021 B at 3.3 KB/sec)
[INFO] Downloading: http://repository.apache.org/snapshots/org/apache/sling/org.apache.sling.launchpad.test-services/2.0.15-SNAPSHOT/maven-metadata.xml
[INFO] Downloaded: http://repository.apache.org/snapshots/org/apache/sling/org.apache.sling.launchpad.test-services/2.0.15-SNAPSHOT/maven-metadata.xml
(2 KB at 3.3 KB/sec)
[INFO] Downloading: http://repository.apache.org/snapshots/org/apache/sling/org.apache.sling.launchpad.test-bundles/0.0.5-SNAPSHOT/org.apache.sling.launchpad.test-bundles-0.0.5-20180306.224939-11.pom
[INFO] Downloaded: http://repository.apache.org/snapshots/org/apache/sling/org.apache.sling.launchpad.test-bundles/0.0.5-SNAPSHOT/org.apache.sling.launchpad.test-bundles-0.0.5-20180306.224939-11.pom
(3 KB at 7.3 KB/sec)
[INFO] Downloading: http://repository.apache.org/snapshots/org/apache/sling/org.apache.sling.starter/11-SNAPSHOT/org.apache.sling.starter-11-20180310.065852-21.pom
[INFO] Downloaded: http://repository.apache.org/snapshots/org/apache/sling/org.apache.sling.starter/11-SNAPSHOT/org.apache.sling.starter-11-20180310.065852-21.pom
(8 KB at 22.1 KB/sec)
[INFO] Downloading: http://repository.apache.org/snapshots/org/apache/sling/org.apache.sling.launchpad.test-fragment/2.0.15-SNAPSHOT/maven-metadata.xml
[INFO] Downloaded: http://repository.apache.org/snapshots/org/apache/sling/org.apache.sling.launchpad.test-fragment/2.0.15-SNAPSHOT/maven-metadata.xml
(2 KB at 3.4 KB/sec)
[INFO] Downloading: http://repository.apache.org/snapshots/org/apache/sling/org.apache.sling.launchpad.test-fragment/2.0.15-SNAPSHOT/org.apache.sling.launchpad.test-fragment-2.0.15-20180311.001602-11.pom
[INFO] Downloaded: http://repository.apache.org/snapshots/org/apache/sling/org.apache.sling.launchpad.test-fragment/2.0.15-SNAPSHOT/org.apache.sling.launchpad.test-fragment-2.0.15-20180311.001602-11.pom
(3 KB at 9.2 KB/sec)
[INFO] Downloading: http://repository.apache.org/snapshots/org/apache/sling/org.apache.sling.launchpad.test-services-war/2.0.15-SNAPSHOT/maven-metadata.xml
[INFO] Downloaded: http://repository.apache.org/snapshots/org/apache/sling/org.apache.sling.launchpad.test-services-war/2.0.15-SNAPSHOT/maven-metadata.xml
(2 KB at 3.3 KB/sec)
[INFO] Downloading: http://repository.apache.org/snapshots/org/apache/sling/org.apache.sling.auth.form/1.0.9-SNAPSHOT/maven-metadata.xml
[INFO] Downloaded: http://repository.apache.org/snapshots/org/apache/sling/org.apache.sling.auth.form/1.0.9-SNAPSHOT/maven-metadata.xml
(1018 B at 3.4 KB/sec)
[INFO] Downloading: http://repository.apache.org/snapshots/org/apache/sling/org.apache.sling.auth.form/1.0.9-SNAPSHOT/org.apache.sling.auth.form-1.0.9-20180305.164326-1784.pom
[INFO] Downloaded: http://repository.apache.org/snapshots/org/apache/sling/org.apache.sling.auth.form/1.0.9-SNAPSHOT/org.apache.sling.auth.form-1.0.9-20180305.164326-1784.pom
(9 KB at 24.9 KB/sec)
[INFO] Downloading: http://repository.apache.org/snapshots/org/apache/sling/org.apache.sling.launchpad.content/2.0.13-SNAPSHOT/maven-metadata.xml
[INFO] Downloaded: http://repository.apache.org/snapshots/org/apache/sling/org.apache.sling.launchpad.content/2.0.13-SNAPSHOT/maven-metadata.xml
(1022 B at 3.3 KB/sec)
[INFO] Downloading: http://repository.apache.org/snapshots/org/apache/sling/org.apache.sling.launchpad.integration-tests/1.0.7-SNAPSHOT/org.apache.sling.launchpad.integration-tests-1.0.7-20180312.062603-26.jar
[INFO] Downloading: http://repository.apache.org/snapshots/org/apache/sling/org.apache.sling.launchpad.test-fragment/2.0.15-SNAPSHOT/org.apache.sling.launchpad.test-fragment-2.0.15-20180311.001602-11.jar
[INFO] Downloading: http://repository.apache.org/snapshots/org/apache/sling/org.apache.sling.auth.form/1.0.9-SNAPSHOT/org.apache.sling.auth.form-1.0.9-20180305.164326-1784.jar
[INFO] Downloaded: http://repository.apache.org/snapshots/org/apache/sling/org.apache.sling.launchpad.test-fragment/2.0.15-SNAPSHOT/org.apache.sling.launchpad.test-fragment-2.0.15-20180311.001602-11.jar
(9 KB at 29.7 KB/sec)
[INFO] Downloaded: http://repository.apache.org/snapshots/org/apache/sling/org.apache.sling.auth.form/1.0.9-SNAPSHOT/org.apache.sling.auth.form-1.0.9-20180305.164326-1784.jar
(59 KB at 125.3 KB/sec)
[INFO] Downloaded: http://repository.apache.org/snapshots/org/apache/sling/org.apache.sling.launchpad.integration-tests/1.0.7-SNAPSHOT/org.apache.sling.launchpad.integration-tests-1.0.7-20180312.062603-26.jar
(485 KB at 736.4 KB/sec)
[INFO] 
[INFO] --- maven-clean-plugin:3.0.0:clean (default-clean) @ org.apache.sling.launchpad.testing
---
[INFO] Deleting <https://builds.apache.org/job/sling-org-apache-sling-launchpad-testing-10/ws/target>
[INFO] 
[INFO] --- maven-enforcer-plugin:3.0.0-M1:enforce (enforce-property-values) @ org.apache.sling.launchpad.testing
---
[INFO] 
[INFO] --- maven-enforcer-plugin:3.0.0-M1:enforce (enforce-java) @ org.apache.sling.launchpad.testing
---
[INFO] 
[INFO] --- maven-enforcer-plugin:3.0.0-M1:enforce (ban-maven-scr-plugin) @ org.apache.sling.launchpad.testing
---
[INFO] 
[INFO] --- maven-remote-resources-plugin:1.5:process (process-resource-bundles) @ org.apache.sling.launchpad.testing
---
[INFO] 
[INFO] --- maven-remote-resources-plugin:1.5:process (default) @ org.apache.sling.launchpad.testing
---
[INFO] 
[INFO] --- maven-resources-plugin:2.7:resources (default-resources) @ org.apache.sling.launchpad.testing
---
[INFO] Using 'UTF-8' encoding to copy filtered resources.
[INFO] skip non existing resourceDirectory <https://builds.apache.org/job/sling-org-apache-sling-launchpad-testing-10/ws/src/main/resources>
[INFO] Copying 3 resources
[INFO] Copying 3 resources
[INFO] 
[INFO] --- build-helper-maven-plugin:3.0.0:reserve-network-port (reserve-network-port) @ org.apache.sling.launchpad.testing
---
[INFO] Port assigned41000
[INFO] Reserved port 41000 for http.port
[INFO] Port assigned41001
[INFO] Reserved port 41001 for sling.control.port
[INFO] 
[INFO] --- maven-compiler-plugin:3.7.0:compile (default-compile) @ org.apache.sling.launchpad.testing
---
[INFO] No sources to compile
[INFO] 
[INFO] --- maven-resources-plugin:2.7:testResources (default-testResources) @ org.apache.sling.launchpad.testing
---
[INFO] Using 'UTF-8' encoding to copy filtered resources.
[INFO] Copying 1 resource
[INFO] Copying 3 resources
[INFO] Copying 3 resources
[INFO] 
[INFO] --- maven-compiler-plugin:3.7.0:testCompile (default-testCompile) @ org.apache.sling.launchpad.testing
---
[INFO] No sources to compile
[INFO] 
[INFO] --- maven-surefire-plugin:2.20.1:test (default-test) @ org.apache.sling.launchpad.testing
---
[JENKINS] Recording test results
[INFO] 
[INFO] --- slingstart-maven-plugin:1.7.16:prepare-package (default-prepare-package) @ org.apache.sling.launchpad.testing
---
[INFO] 
[INFO] --- slingstart-maven-plugin:1.7.16:attach-slingfeature (default-attach-slingfeature)
@ org.apache.sling.launchpad.testing ---
[INFO] 
[INFO] --- slingstart-maven-plugin:1.7.16:package (default-package) @ org.apache.sling.launchpad.testing
---
[INFO] Packaging standalone jar...
[INFO] Building zip: <https://builds.apache.org/job/sling-org-apache-sling-launchpad-testing-10/ws/target/org.apache.sling.launchpad.testing-11-SNAPSHOT.jar>
[INFO] 
[INFO] >>> maven-source-plugin:3.0.1:jar (attach-sources) > generate-sources @
org.apache.sling.launchpad.testing >>>
[INFO] 
[INFO] --- maven-enforcer-plugin:3.0.0-M1:enforce (enforce-property-values) @ org.apache.sling.launchpad.testing
---
[INFO] 
[INFO] --- maven-enforcer-plugin:3.0.0-M1:enforce (enforce-java) @ org.apache.sling.launchpad.testing
---
[INFO] 
[INFO] --- maven-enforcer-plugin:3.0.0-M1:enforce (ban-maven-scr-plugin) @ org.apache.sling.launchpad.testing
---
[WARNING] Failed to getClass for org.apache.maven.plugins.source.SourceJarMojo
[INFO] 
[INFO] <<< maven-source-plugin:3.0.1:jar (attach-sources) < generate-sources @
org.apache.sling.launchpad.testing <<<
[INFO] 
[INFO] --- maven-source-plugin:3.0.1:jar (attach-sources) @ org.apache.sling.launchpad.testing
---
[INFO] Building jar: <https://builds.apache.org/job/sling-org-apache-sling-launchpad-testing-10/ws/target/org.apache.sling.launchpad.testing-11-SNAPSHOT-sources.jar>
[INFO] 
[INFO] --- maven-site-plugin:3.5.1:attach-descriptor (attach-descriptor) @ org.apache.sling.launchpad.testing
---
[INFO] 
[INFO] --- slingstart-maven-plugin:1.7.16:start (start-container) @ org.apache.sling.launchpad.testing
---
[INFO] Using launchpad jar being generated as this project's primary artifact: '<https://builds.apache.org/job/sling-org-apache-sling-launchpad-testing-10/ws/target/org.apache.sling.launchpad.testing-11-SNAPSHOT.jar'!>
[INFO] Starting Launchpad _-41000...
-------------------------------------------------------------------
Slingstart application: <https://builds.apache.org/job/sling-org-apache-sling-launchpad-testing-10/ws/target/_-41000/org.apache.sling.launchpad.testing-11-SNAPSHOT.jar>
Main class: org.apache.sling.launchpad.app.Main
Listener Port: 34481
Arguments: [-p, 41000, -j, 41001]
-------------------------------------------------------------------
12.03.2018 06:27:56.323 *INFO * [main] Setting sling.home=sling (default)
12.03.2018 06:27:56.327 *INFO * [main] Starting Apache Sling in <https://builds.apache.org/job/sling-org-apache-sling-launchpad-testing-10/ws/target/_-41000/sling>
12.03.2018 06:27:56.331 *INFO * [main] Sling  Extension Lib Home : <https://builds.apache.org/job/sling-org-apache-sling-launchpad-testing-10/ws/target/_-41000/sling/ext>
12.03.2018 06:27:56.331 *INFO * [main] Checking launcher JAR in folder <https://builds.apache.org/job/sling-org-apache-sling-launchpad-testing-10/ws/target/_-41000/sling>
12.03.2018 06:27:56.348 *INFO * [main] Installing new launcher: jar:<https://builds.apache.org/job/sling-org-apache-sling-launchpad-testing-10/ws/target/_-41000/org.apache.sling.launchpad.testing-11-SNAPSHOT.jar!/resources/org.apache.sling.launchpad.base.jar,>
5.6.10.2_6_26 (org.apache.sling.launchpad.base.jar.1520836076348)
12.03.2018 06:27:56.350 *INFO * [main] Loading launcher class org.apache.sling.launchpad.base.app.MainDelegate
from org.apache.sling.launchpad.base.jar.1520836076348
12.03.2018 06:27:56.350 *INFO * [main] External Libs Home (ext) is null or does not exists.
12.03.2018 06:27:56.368 *INFO * [main] Setting sling.launchpad=<https://builds.apache.org/job/sling-org-apache-sling-launchpad-testing-10/ws/target/_-41000/sling>
12.03.2018 06:27:56.368 *INFO * [main] Setting org.osgi.service.http.port=41000
12.03.2018 06:27:56.368 *INFO * [main] Setting sling.control.socket=41001
12.03.2018 06:27:56.368 *INFO * [main] Starting launcher ...
12.03.2018 06:27:56.378 *INFO * [main] HTTP server port: 41000
WARNING: An illegal reflective access operation has occurred
WARNING: Illegal reflective access by org.apache.felix.framework.ext.ClassPathExtenderFactory$DefaultClassLoaderExtender
(<https://builds.apache.org/job/sling-org-apache-sling-launchpad-testing-10/ws/target/_-41000/sling/org.apache.sling.launchpad.base.jar.1520836076348)>
to method java.net.URLClassLoader.addURL(java.net.URL)
WARNING: Please consider reporting this to the maintainers of org.apache.felix.framework.ext.ClassPathExtenderFactory$DefaultClassLoaderExtender
WARNING: Use --illegal-access=warn to enable warnings of further illegal reflective access
operations
WARNING: All illegal access operations will be denied in a future release
12.03.2018 06:27:57.807 *INFO * [main] Startup completed
12.03.2018 06:27:57.983 *INFO* [OsgiInstallerImpl] org.apache.sling.audit.osgi.installer Installed
configuration org.apache.sling.commons.log.LogManager.factory.config.d67d2474-3327-4fe8-bc2f-f562de5e4372
from resource TaskResource(url=launchpad:resources/config/org.apache.sling.commons.log.LogManager.factory.config-request.log.config,
entity=config:org.apache.sling.commons.log.LogManager.factory.config.request.log, state=INSTALL,
attributes=[org.apache.sling.installer.api.tasks.ResourceTransformer=:19:, service.factoryPid=org.apache.sling.commons.log.LogManager.factory.config,
service.pid=request.log], digest=1f7e7bbc8a9f8e477a28bcfbbfc4402a)
12.03.2018 06:27:57.985 *INFO* [OsgiInstallerImpl] org.apache.sling.audit.osgi.installer Installed
configuration org.apache.sling.engine.impl.log.RequestLogger from resource TaskResource(url=launchpad:resources/config/org.apache.sling.engine.impl.log.RequestLogger.config,
entity=config:org.apache.sling.engine.impl.log.RequestLogger, state=INSTALL, attributes=[org.apache.sling.installer.api.tasks.ResourceTransformer=:19:,
service.pid=org.apache.sling.engine.impl.log.RequestLogger], digest=a475207c9e345f2a0e987500d3df7fc4)
12.03.2018 06:27:57.986 *INFO* [OsgiInstallerImpl] org.apache.sling.audit.osgi.installer Installed
configuration org.apache.sling.jcr.base.internal.LoginAdminWhitelist from resource TaskResource(url=launchpad:resources/config/org.apache.sling.jcr.base.internal.LoginAdminWhitelist.config,
entity=config:org.apache.sling.jcr.base.internal.LoginAdminWhitelist, state=INSTALL, attributes=[org.apache.sling.installer.api.tasks.ResourceTransformer=:19:,
service.pid=org.apache.sling.jcr.base.internal.LoginAdminWhitelist], digest=251b8528cdb27078e3831df85db59aea)
12.03.2018 06:27:57.996 *INFO* [OsgiInstallerImpl] org.apache.sling.audit.osgi.installer Installed
configuration org.apache.sling.jcr.webdav.impl.servlets.SimpleWebDavServlet from resource
TaskResource(url=launchpad:resources/config/org.apache.sling.jcr.webdav.impl.servlets.SimpleWebDavServlet.config,
entity=config:org.apache.sling.jcr.webdav.impl.servlets.SimpleWebDavServlet, state=INSTALL,
attributes=[org.apache.sling.installer.api.tasks.ResourceTransformer=:19:, service.pid=org.apache.sling.jcr.webdav.impl.servlets.SimpleWebDavServlet],
digest=40b06a2412e7e842f149163de5a9ae75)
12.03.2018 06:27:57.997 *INFO* [OsgiInstallerImpl] org.apache.sling.audit.osgi.installer Installed
configuration org.apache.sling.scripting.core.impl.ScriptCacheImpl from resource TaskResource(url=launchpad:resources/config/org.apache.sling.scripting.core.impl.ScriptCacheImpl.config,
entity=config:org.apache.sling.scripting.core.impl.ScriptCacheImpl, state=INSTALL, attributes=[org.apache.sling.installer.api.tasks.ResourceTransformer=:19:,
service.pid=org.apache.sling.scripting.core.impl.ScriptCacheImpl], digest=13b57519a048a6c8873ed61949d013f6)
12.03.2018 06:27:57.999 *INFO* [OsgiInstallerImpl] org.apache.sling.audit.osgi.installer Installed
configuration org.apache.sling.serviceusermapping.impl.ServiceUserMapperImpl.amended.e512b6ec-7819-457e-8771-4a3f3e2c477e
from resource TaskResource(url=launchpad:resources/config/org.apache.sling.serviceusermapping.impl.ServiceUserMapperImpl.amended-i18n.config,
entity=config:org.apache.sling.serviceusermapping.impl.ServiceUserMapperImpl.amended.i18n,
state=INSTALL, attributes=[org.apache.sling.installer.api.tasks.ResourceTransformer=:19:,
service.factoryPid=org.apache.sling.serviceusermapping.impl.ServiceUserMapperImpl.amended,
service.pid=i18n], digest=5ca453becbd0de7378d7d5707823f9a8)
12.03.2018 06:27:58.001 *INFO* [OsgiInstallerImpl] org.apache.sling.audit.osgi.installer Installed
configuration org.apache.sling.serviceusermapping.impl.ServiceUserMapperImpl.amended.59aef3a3-9242-4c9e-ba73-18bc8462b8a1
from resource TaskResource(url=launchpad:resources/config/org.apache.sling.serviceusermapping.impl.ServiceUserMapperImpl.amended-jcr-install.config,
entity=config:org.apache.sling.serviceusermapping.impl.ServiceUserMapperImpl.amended.jcr-install,
state=INSTALL, attributes=[org.apache.sling.installer.api.tasks.ResourceTransformer=:19:,
service.factoryPid=org.apache.sling.serviceusermapping.impl.ServiceUserMapperImpl.amended,
service.pid=jcr-install], digest=c54b829f7b7740a799d99e251af020c9)
12.03.2018 06:27:58.003 *INFO* [OsgiInstallerImpl] org.apache.sling.audit.osgi.installer Installed
configuration org.apache.sling.serviceusermapping.impl.ServiceUserMapperImpl.amended.36378138-bce8-4853-a3d0-32dbfc508e1a
from resource TaskResource(url=launchpad:resources/config/org.apache.sling.serviceusermapping.impl.ServiceUserMapperImpl.amended-jcr-resource.config,
entity=config:org.apache.sling.serviceusermapping.impl.ServiceUserMapperImpl.amended.jcr-resource,
state=INSTALL, attributes=[org.apache.sling.installer.api.tasks.ResourceTransformer=:19:,
service.factoryPid=org.apache.sling.serviceusermapping.impl.ServiceUserMapperImpl.amended,
service.pid=jcr-resource], digest=8b9c2b1535ffb961711fa342f873d589)
12.03.2018 06:27:58.005 *INFO* [OsgiInstallerImpl] org.apache.sling.audit.osgi.installer Installed
configuration org.apache.sling.serviceusermapping.impl.ServiceUserMapperImpl.amended.f2107bbb-1ed8-48ee-94a9-55b96e572410
from resource TaskResource(url=launchpad:resources/config/org.apache.sling.serviceusermapping.impl.ServiceUserMapperImpl.amended-observation.config,
entity=config:org.apache.sling.serviceusermapping.impl.ServiceUserMapperImpl.amended.observation,
state=INSTALL, attributes=[org.apache.sling.installer.api.tasks.ResourceTransformer=:19:,
service.factoryPid=org.apache.sling.serviceusermapping.impl.ServiceUserMapperImpl.amended,
service.pid=observation], digest=b358fca04fc5775b5fee0983520f157b)
[INFO] Started Launchpad '_-41000' at port 41000 [run modes: null]
Mar 12, 2018 6:28:00 AM org.apache.tika.config.InitializableProblemHandler$3 handleInitializableProblem
WARNING: JBIG2ImageReader not loaded. jbig2 files will be ignored
See https://pdfbox.apache.org/2.0/dependencies.html#jai-image-io
for optional dependencies.
TIFFImageWriter not loaded. tiff files will not be processed
See https://pdfbox.apache.org/2.0/dependencies.html#jai-image-io
for optional dependencies.
J2KImageReader not loaded. JPEG2000 files will not be processed.
See https://pdfbox.apache.org/2.0/dependencies.html#jai-image-io
for optional dependencies.

Mar 12, 2018 6:28:00 AM org.apache.tika.config.InitializableProblemHandler$3 handleInitializableProblem
WARNING: org.xerial's sqlite-jdbc is not loaded.
Please provide the jar on your classpath to parse sqlite files.
See tika-parsers/pom.xml for the correct version.
[INFO] 
[INFO] --- maven-failsafe-plugin:2.20.1:integration-test (default) @ org.apache.sling.launchpad.testing
---
[JENKINS] Recording test results
[JENKINS] Archiving disabled
[JENKINS] Archiving disabled
[INFO] ------------------------------------------------------------------------
[INFO] BUILD FAILURE
[INFO] ------------------------------------------------------------------------
[INFO] Total time: 48.627 s
[INFO] Finished at: 2018-03-12T06:28:06+00:00
[INFO] Final Memory: 41M/256M
[INFO] ------------------------------------------------------------------------
Waiting for Jenkins to finish collecting data
Attempting to load ESAPI.properties via file I/O.
Attempting to load ESAPI.properties as resource file via file I/O.
Not found in 'org.owasp.esapi.resources' directory or file not readable: <https://builds.apache.org/job/sling-org-apache-sling-launchpad-testing-10/ws/target/_-41000/ESAPI.properties>
Not found in SystemResource Directory/resourceDirectory: .esapi/ESAPI.properties
Not found in 'user.home' (/home/jenkins) directory: /home/jenkins/esapi/ESAPI.properties
Loading ESAPI.properties via file I/O failed. Exception was: java.io.FileNotFoundException
Attempting to load ESAPI.properties via the classpath.
SUCCESSFULLY LOADED ESAPI.properties via the CLASSPATH from '/ (root)' using class loader
for DefaultSecurityConfiguration class!
Attempting to load validation.properties via file I/O.
Attempting to load validation.properties as resource file via file I/O.
Not found in 'org.owasp.esapi.resources' directory or file not readable: <https://builds.apache.org/job/sling-org-apache-sling-launchpad-testing-10/ws/target/_-41000/validation.properties>
Not found in SystemResource Directory/resourceDirectory: .esapi/validation.properties
Not found in 'user.home' (/home/jenkins) directory: /home/jenkins/esapi/validation.properties
Loading validation.properties via file I/O failed.
Attempting to load validation.properties via the classpath.
SUCCESSFULLY LOADED validation.properties via the CLASSPATH from '/ (root)' using class loader
for DefaultSecurityConfiguration class!
[ERROR] Failed to execute goal org.apache.maven.plugins:maven-failsafe-plugin:2.20.1:integration-test
(default) on project org.apache.sling.launchpad.testing: Execution default of goal org.apache.maven.plugins:maven-failsafe-plugin:2.20.1:integration-test
failed. NullPointerException -> [Help 1]
[ERROR] 
[ERROR] To see the full stack trace of the errors, re-run Maven with the -e switch.
[ERROR] Re-run Maven using the -X switch to enable full debug logging.
[ERROR] 
[ERROR] For more information about the errors and possible solutions, please read the following
articles:
[ERROR] [Help 1] http://cwiki.apache.org/confluence/display/MAVEN/PluginExecutionException
channel stopped
Terminating launchpad _-41000
12.03.2018 06:28:13.085 *INFO * [Apache Sling Terminator] Java VM is shutting down
12.03.2018 06:28:13.086 *INFO * [Apache Sling Terminator] Stopping Apache Sling
Archiving artifacts
12.03.2018 06:28:14.298 *INFO * [Sling Notifier] Apache Sling has been stopped
Recording test results

Mime
View raw message