sling-commits mailing list archives

Site index · List index
Message view « Date » · « Thread »
Top « Date » · « Thread »
From Apache Jenkins Server <jenk...@builds.apache.org>
Subject Build failed in Jenkins: sling-org-apache-sling-jcr-oak-server-1.8 #47
Date Mon, 05 Mar 2018 00:36:53 GMT
See <https://builds.apache.org/job/sling-org-apache-sling-jcr-oak-server-1.8/47/display/redirect>

------------------------------------------
Started by timer
[EnvInject] - Loading node environment variables.
Building remotely on H31 (ubuntu xenial) in workspace <https://builds.apache.org/job/sling-org-apache-sling-jcr-oak-server-1.8/ws/>
 > git rev-parse --is-inside-work-tree # timeout=10
Fetching changes from the remote Git repository
 > git config remote.origin.url https://github.com/apache/sling-org-apache-sling-jcr-oak-server.git
# timeout=10
Fetching upstream changes from https://github.com/apache/sling-org-apache-sling-jcr-oak-server.git
 > git --version # timeout=10
 > git fetch --tags --progress https://github.com/apache/sling-org-apache-sling-jcr-oak-server.git
+refs/heads/*:refs/remotes/origin/*
 > git rev-parse origin/master^{commit} # timeout=10
Checking out Revision e8e1ea0e1fd41a5b5278a5042266daa89bafa29e (origin/master)
 > git config core.sparsecheckout # timeout=10
 > git checkout -f e8e1ea0e1fd41a5b5278a5042266daa89bafa29e
Commit message: "[maven-release-plugin] prepare for next development iteration"
 > git rev-list --no-walk e8e1ea0e1fd41a5b5278a5042266daa89bafa29e # timeout=10
Parsing POMs
Established TCP socket on 44306
maven33-agent.jar already up to date
maven33-interceptor.jar already up to date
maven3-interceptor-commons.jar already up to date
[sling-org-apache-sling-jcr-oak-server-1.8] $ /home/jenkins/tools/java/latest1.8/bin/java
-Xmx2g -Xms256m -cp /home/jenkins/jenkins-slave/maven33-agent.jar:/home/jenkins/tools/maven/apache-maven-3.3.9/boot/plexus-classworlds-2.5.2.jar:/home/jenkins/tools/maven/apache-maven-3.3.9/conf/logging
jenkins.maven3.agent.Maven33Main /home/jenkins/tools/maven/apache-maven-3.3.9 /home/jenkins/jenkins-slave/slave.jar
/home/jenkins/jenkins-slave/maven33-interceptor.jar /home/jenkins/jenkins-slave/maven3-interceptor-commons.jar
44306
<===[JENKINS REMOTING CAPACITY]===>   channel started
Executing Maven:  -B -f <https://builds.apache.org/job/sling-org-apache-sling-jcr-oak-server-1.8/ws/pom.xml>
-Dmaven.repo.local=/home/jenkins/jenkins-slave/maven-repositories/0 -U clean deploy
[INFO] Scanning for projects...
[INFO]                                                                         
[INFO] ------------------------------------------------------------------------
[INFO] Building Apache Sling JCR Oak Repository Server 1.2.1-SNAPSHOT
[INFO] ------------------------------------------------------------------------
[INFO] Downloading: https://repo.maven.apache.org/maven2/org/apache/jackrabbit/oak-core/1.8.2/oak-core-1.8.2.pom
[INFO] Downloaded: https://repo.maven.apache.org/maven2/org/apache/jackrabbit/oak-core/1.8.2/oak-core-1.8.2.pom
(10 KB at 26.0 KB/sec)
[INFO] Downloading: https://repo.maven.apache.org/maven2/org/apache/jackrabbit/oak-parent/1.8.2/oak-parent-1.8.2.pom
[INFO] Downloaded: https://repo.maven.apache.org/maven2/org/apache/jackrabbit/oak-parent/1.8.2/oak-parent-1.8.2.pom
(40 KB at 1022.0 KB/sec)
[INFO] Downloading: https://repo.maven.apache.org/maven2/org/apache/jackrabbit/oak-api/1.8.2/oak-api-1.8.2.pom
[INFO] Downloaded: https://repo.maven.apache.org/maven2/org/apache/jackrabbit/oak-api/1.8.2/oak-api-1.8.2.pom
(4 KB at 194.6 KB/sec)
[INFO] Downloading: https://repo.maven.apache.org/maven2/org/apache/jackrabbit/oak-core-spi/1.8.2/oak-core-spi-1.8.2.pom
[INFO] Downloaded: https://repo.maven.apache.org/maven2/org/apache/jackrabbit/oak-core-spi/1.8.2/oak-core-spi-1.8.2.pom
(7 KB at 334.9 KB/sec)
[INFO] Downloading: https://repo.maven.apache.org/maven2/org/apache/jackrabbit/oak-commons/1.8.2/oak-commons-1.8.2.pom
[INFO] Downloaded: https://repo.maven.apache.org/maven2/org/apache/jackrabbit/oak-commons/1.8.2/oak-commons-1.8.2.pom
(4 KB at 210.2 KB/sec)
[INFO] Downloading: https://repo.maven.apache.org/maven2/org/apache/jackrabbit/oak-query-spi/1.8.2/oak-query-spi-1.8.2.pom
[INFO] Downloaded: https://repo.maven.apache.org/maven2/org/apache/jackrabbit/oak-query-spi/1.8.2/oak-query-spi-1.8.2.pom
(5 KB at 250.5 KB/sec)
[INFO] Downloading: https://repo.maven.apache.org/maven2/org/apache/jackrabbit/oak-store-spi/1.8.2/oak-store-spi-1.8.2.pom
[INFO] Downloaded: https://repo.maven.apache.org/maven2/org/apache/jackrabbit/oak-store-spi/1.8.2/oak-store-spi-1.8.2.pom
(6 KB at 313.4 KB/sec)
[INFO] Downloading: https://repo.maven.apache.org/maven2/org/apache/jackrabbit/oak-security-spi/1.8.2/oak-security-spi-1.8.2.pom
[INFO] Downloaded: https://repo.maven.apache.org/maven2/org/apache/jackrabbit/oak-security-spi/1.8.2/oak-security-spi-1.8.2.pom
(7 KB at 385.6 KB/sec)
[INFO] Downloading: https://repo.maven.apache.org/maven2/org/apache/jackrabbit/oak-blob-plugins/1.8.2/oak-blob-plugins-1.8.2.pom
[INFO] Downloaded: https://repo.maven.apache.org/maven2/org/apache/jackrabbit/oak-blob-plugins/1.8.2/oak-blob-plugins-1.8.2.pom
(7 KB at 460.3 KB/sec)
[INFO] Downloading: https://repo.maven.apache.org/maven2/org/apache/jackrabbit/oak-blob/1.8.2/oak-blob-1.8.2.pom
[INFO] Downloaded: https://repo.maven.apache.org/maven2/org/apache/jackrabbit/oak-blob/1.8.2/oak-blob-1.8.2.pom
(5 KB at 247.3 KB/sec)
[INFO] Downloading: https://repo.maven.apache.org/maven2/org/apache/jackrabbit/oak-jcr/1.8.2/oak-jcr-1.8.2.pom
[INFO] Downloaded: https://repo.maven.apache.org/maven2/org/apache/jackrabbit/oak-jcr/1.8.2/oak-jcr-1.8.2.pom
(21 KB at 836.1 KB/sec)
[INFO] Downloading: https://repo.maven.apache.org/maven2/org/apache/jackrabbit/oak-lucene/1.8.2/oak-lucene-1.8.2.pom
[INFO] Downloaded: https://repo.maven.apache.org/maven2/org/apache/jackrabbit/oak-lucene/1.8.2/oak-lucene-1.8.2.pom
(18 KB at 758.7 KB/sec)
[INFO] Downloading: https://repo.maven.apache.org/maven2/org/apache/jackrabbit/oak-store-document/1.8.2/oak-store-document-1.8.2.pom
[INFO] Downloaded: https://repo.maven.apache.org/maven2/org/apache/jackrabbit/oak-store-document/1.8.2/oak-store-document-1.8.2.pom
(11 KB at 527.6 KB/sec)
[INFO] Downloading: https://repo.maven.apache.org/maven2/org/apache/sling/org.apache.sling.testing.paxexam/2.0.0/org.apache.sling.testing.paxexam-2.0.0.pom
[WARNING] The POM for org.apache.sling:org.apache.sling.testing.paxexam:jar:2.0.0 is missing,
no dependency information available
[INFO] Downloading: https://repo.maven.apache.org/maven2/org/apache/jackrabbit/oak-core/1.8.2/oak-core-1.8.2.jar
[INFO] Downloading: https://repo.maven.apache.org/maven2/org/apache/jackrabbit/oak-api/1.8.2/oak-api-1.8.2.jar
[INFO] Downloading: https://repo.maven.apache.org/maven2/org/apache/jackrabbit/oak-core-spi/1.8.2/oak-core-spi-1.8.2.jar
[INFO] Downloading: https://repo.maven.apache.org/maven2/org/apache/jackrabbit/oak-security-spi/1.8.2/oak-security-spi-1.8.2.jar
[INFO] Downloading: https://repo.maven.apache.org/maven2/org/apache/jackrabbit/oak-commons/1.8.2/oak-commons-1.8.2.jar
[INFO] Downloaded: https://repo.maven.apache.org/maven2/org/apache/jackrabbit/oak-api/1.8.2/oak-api-1.8.2.jar
(38 KB at 811.8 KB/sec)
[INFO] Downloading: https://repo.maven.apache.org/maven2/org/apache/jackrabbit/oak-blob-plugins/1.8.2/oak-blob-plugins-1.8.2.jar
[INFO] Downloaded: https://repo.maven.apache.org/maven2/org/apache/jackrabbit/oak-commons/1.8.2/oak-commons-1.8.2.jar
(98 KB at 1599.1 KB/sec)
[INFO] Downloaded: https://repo.maven.apache.org/maven2/org/apache/jackrabbit/oak-core-spi/1.8.2/oak-core-spi-1.8.2.jar
(148 KB at 2380.0 KB/sec)
[INFO] Downloading: https://repo.maven.apache.org/maven2/org/apache/jackrabbit/oak-store-spi/1.8.2/oak-store-spi-1.8.2.jar
[INFO] Downloading: https://repo.maven.apache.org/maven2/org/apache/jackrabbit/oak-blob/1.8.2/oak-blob-1.8.2.jar
[INFO] Downloaded: https://repo.maven.apache.org/maven2/org/apache/jackrabbit/oak-security-spi/1.8.2/oak-security-spi-1.8.2.jar
(225 KB at 3408.8 KB/sec)
[INFO] Downloading: https://repo.maven.apache.org/maven2/org/apache/jackrabbit/oak-query-spi/1.8.2/oak-query-spi-1.8.2.jar
[INFO] Downloaded: https://repo.maven.apache.org/maven2/org/apache/jackrabbit/oak-blob-plugins/1.8.2/oak-blob-plugins-1.8.2.jar
(207 KB at 2486.9 KB/sec)
[INFO] Downloading: https://repo.maven.apache.org/maven2/org/apache/jackrabbit/oak-jcr/1.8.2/oak-jcr-1.8.2.jar
[INFO] Downloaded: https://repo.maven.apache.org/maven2/org/apache/jackrabbit/oak-query-spi/1.8.2/oak-query-spi-1.8.2.jar
(49 KB at 574.7 KB/sec)
[INFO] Downloading: https://repo.maven.apache.org/maven2/org/apache/jackrabbit/oak-lucene/1.8.2/oak-lucene-1.8.2.jar
[INFO] Downloaded: https://repo.maven.apache.org/maven2/org/apache/jackrabbit/oak-blob/1.8.2/oak-blob-1.8.2.jar
(55 KB at 635.6 KB/sec)
[INFO] Downloading: https://repo.maven.apache.org/maven2/org/apache/jackrabbit/oak-store-document/1.8.2/oak-store-document-1.8.2.jar
[INFO] Downloaded: https://repo.maven.apache.org/maven2/org/apache/jackrabbit/oak-store-spi/1.8.2/oak-store-spi-1.8.2.jar
(236 KB at 2331.0 KB/sec)
[INFO] Downloading: https://repo.maven.apache.org/maven2/org/apache/sling/org.apache.sling.testing.paxexam/2.0.0/org.apache.sling.testing.paxexam-2.0.0.jar
[INFO] Downloaded: https://repo.maven.apache.org/maven2/org/apache/jackrabbit/oak-jcr/1.8.2/oak-jcr-1.8.2.jar
(548 KB at 3529.2 KB/sec)
[INFO] Downloaded: https://repo.maven.apache.org/maven2/org/apache/jackrabbit/oak-core/1.8.2/oak-core-1.8.2.jar
(1513 KB at 8447.7 KB/sec)
[INFO] Downloaded: https://repo.maven.apache.org/maven2/org/apache/jackrabbit/oak-store-document/1.8.2/oak-store-document-1.8.2.jar
(1038 KB at 5135.9 KB/sec)
[INFO] Downloaded: https://repo.maven.apache.org/maven2/org/apache/jackrabbit/oak-lucene/1.8.2/oak-lucene-1.8.2.jar
(5681 KB at 12457.3 KB/sec)
[JENKINS] Archiving disabled
[JENKINS] Archiving disabled
[INFO] ------------------------------------------------------------------------
[INFO] BUILD FAILURE
[INFO] ------------------------------------------------------------------------
[INFO] Total time: 8.946 s
[INFO] Finished at: 2018-03-05T00:36:51+00:00
[INFO] Final Memory: 17M/292M
[INFO] ------------------------------------------------------------------------
[ERROR] Failed to execute goal on project org.apache.sling.jcr.oak.server: Could not resolve
dependencies for project org.apache.sling:org.apache.sling.jcr.oak.server:jar:1.2.1-SNAPSHOT:
Could not find artifact org.apache.sling:org.apache.sling.testing.paxexam:jar:2.0.0 in central
(https://repo.maven.apache.org/maven2) -> [Help 1]
[ERROR] 
[ERROR] To see the full stack trace of the errors, re-run Maven with the -e switch.
[ERROR] Re-run Maven using the -X switch to enable full debug logging.
[ERROR] 
[ERROR] For more information about the errors and possible solutions, please read the following
articles:
[ERROR] [Help 1] http://cwiki.apache.org/confluence/display/MAVEN/DependencyResolutionException
channel stopped
Recording test results
ERROR: Step ?Publish JUnit test result report? failed: Test reports were found but none of
them are new. Did leafNodes run? 
For example, <https://builds.apache.org/job/sling-org-apache-sling-jcr-oak-server-1.8/ws/target/failsafe-reports/TEST-org.apache.sling.jcr.oak.server.it.LoginAdminBlacklistedIT.xml>
is 10 hr old



Mime
View raw message