sling-commits mailing list archives

Site index · List index
Message view « Date » · « Thread »
Top « Date » · « Thread »
From Apache Jenkins Server <jenk...@builds.apache.org>
Subject Build failed in Jenkins: sling-org-apache-sling-launchpad-testing-10 #14
Date Tue, 06 Feb 2018 04:32:02 GMT
See <https://builds.apache.org/job/sling-org-apache-sling-launchpad-testing-10/14/display/redirect>

------------------------------------------
Started by upstream project "sling-org-apache-sling-launchpad-integration-tests-1.8" build
number 28
originally caused by:
 Started by timer
[EnvInject] - Loading node environment variables.
Building remotely on H27 (ubuntu xenial) in workspace <https://builds.apache.org/job/sling-org-apache-sling-launchpad-testing-10/ws/>
 > git rev-parse --is-inside-work-tree # timeout=10
Fetching changes from the remote Git repository
 > git config remote.origin.url https://github.com/apache/sling-org-apache-sling-launchpad-testing.git
# timeout=10
Fetching upstream changes from https://github.com/apache/sling-org-apache-sling-launchpad-testing.git
 > git --version # timeout=10
 > git fetch --tags --progress https://github.com/apache/sling-org-apache-sling-launchpad-testing.git
+refs/heads/*:refs/remotes/origin/*
 > git rev-parse origin/master^{commit} # timeout=10
Checking out Revision 8325d11b2c094ab9fef235abc07e6f1c7c915f50 (origin/master)
 > git config core.sparsecheckout # timeout=10
 > git checkout -f 8325d11b2c094ab9fef235abc07e6f1c7c915f50
Commit message: "SLING-7353 Update to Sling Parent 33"
 > git rev-list 8325d11b2c094ab9fef235abc07e6f1c7c915f50 # timeout=10
Parsing POMs
Established TCP socket on 43348
maven33-agent.jar already up to date
maven33-interceptor.jar already up to date
maven3-interceptor-commons.jar already up to date
[sling-org-apache-sling-launchpad-testing-10] $ /home/jenkins/tools/java/jdk-10-ea+36/bin/java
-Xmx2g -Xms256m -cp /home/jenkins/jenkins-slave/maven33-agent.jar:/home/jenkins/tools/maven/apache-maven-3.3.9/boot/plexus-classworlds-2.5.2.jar:/home/jenkins/tools/maven/apache-maven-3.3.9/conf/logging
jenkins.maven3.agent.Maven33Main /home/jenkins/tools/maven/apache-maven-3.3.9 /home/jenkins/jenkins-slave/slave.jar
/home/jenkins/jenkins-slave/maven33-interceptor.jar /home/jenkins/jenkins-slave/maven3-interceptor-commons.jar
43348
<===[JENKINS REMOTING CAPACITY]===>   channel started
WARNING: An illegal reflective access operation has occurred
WARNING: Illegal reflective access by hudson.remoting.RemoteClassLoader (file:/home/jenkins/jenkins-slave/slave.jar)
to method java.lang.ClassLoader.getClassLoadingLock(java.lang.String)
WARNING: Please consider reporting this to the maintainers of hudson.remoting.RemoteClassLoader
WARNING: Use --illegal-access=warn to enable warnings of further illegal reflective access
operations
WARNING: All illegal access operations will be denied in a future release
Executing Maven:  -B -f <https://builds.apache.org/job/sling-org-apache-sling-launchpad-testing-10/ws/pom.xml>
-Dmaven.repo.local=/home/jenkins/jenkins-slave/maven-repositories/0 -U clean verify
[INFO] Scanning for projects...
[INFO] Downloading: http://repository.apache.org/snapshots/org/apache/sling/org.apache.sling.launchpad.test-bundles/0.0.5-SNAPSHOT/maven-metadata.xml
[INFO] Downloaded: http://repository.apache.org/snapshots/org/apache/sling/org.apache.sling.launchpad.test-bundles/0.0.5-SNAPSHOT/maven-metadata.xml
(1019 B at 2.1 KB/sec)
[INFO] Downloading: http://repository.apache.org/snapshots/org/apache/sling/org.apache.sling.starter/11-SNAPSHOT/maven-metadata.xml
[INFO] Downloaded: http://repository.apache.org/snapshots/org/apache/sling/org.apache.sling.starter/11-SNAPSHOT/maven-metadata.xml
(2 KB at 4.6 KB/sec)
[INFO] Extended Maven classpath (scope 'provided') by the dependencies extracted from the
Sling model.
[INFO]                                                                         
[INFO] ------------------------------------------------------------------------
[INFO] Building Apache Sling Launchpad Testing 11-SNAPSHOT
[INFO] ------------------------------------------------------------------------
[INFO] Downloading: http://repository.apache.org/snapshots/org/apache/sling/org.apache.sling.launchpad.integration-tests/1.0.7-SNAPSHOT/maven-metadata.xml
[INFO] Downloaded: http://repository.apache.org/snapshots/org/apache/sling/org.apache.sling.launchpad.integration-tests/1.0.7-SNAPSHOT/maven-metadata.xml
(1 KB at 3.3 KB/sec)
[INFO] Downloading: http://repository.apache.org/snapshots/org/apache/sling/org.apache.sling.launchpad.test-services/2.0.15-SNAPSHOT/maven-metadata.xml
[INFO] Downloaded: http://repository.apache.org/snapshots/org/apache/sling/org.apache.sling.launchpad.test-services/2.0.15-SNAPSHOT/maven-metadata.xml
(1 KB at 3.4 KB/sec)
[INFO] Downloading: http://repository.apache.org/snapshots/org/apache/sling/org.apache.sling.launchpad.test-fragment/2.0.15-SNAPSHOT/maven-metadata.xml
[INFO] Downloaded: http://repository.apache.org/snapshots/org/apache/sling/org.apache.sling.launchpad.test-fragment/2.0.15-SNAPSHOT/maven-metadata.xml
(1 KB at 3.3 KB/sec)
[INFO] Downloading: http://repository.apache.org/snapshots/org/apache/sling/org.apache.sling.launchpad.test-services-war/2.0.15-SNAPSHOT/maven-metadata.xml
[INFO] Downloaded: http://repository.apache.org/snapshots/org/apache/sling/org.apache.sling.launchpad.test-services-war/2.0.15-SNAPSHOT/maven-metadata.xml
(2 KB at 3.1 KB/sec)
[INFO] 
[INFO] --- maven-clean-plugin:3.0.0:clean (default-clean) @ org.apache.sling.launchpad.testing
---
[INFO] Deleting <https://builds.apache.org/job/sling-org-apache-sling-launchpad-testing-10/ws/target>
[INFO] 
[INFO] --- maven-enforcer-plugin:3.0.0-M1:enforce (enforce-property-values) @ org.apache.sling.launchpad.testing
---
[INFO] 
[INFO] --- maven-enforcer-plugin:3.0.0-M1:enforce (enforce-java) @ org.apache.sling.launchpad.testing
---
[INFO] 
[INFO] --- maven-enforcer-plugin:3.0.0-M1:enforce (ban-maven-scr-plugin) @ org.apache.sling.launchpad.testing
---
[INFO] 
[INFO] --- maven-remote-resources-plugin:1.5:process (process-resource-bundles) @ org.apache.sling.launchpad.testing
---
[INFO] 
[INFO] --- maven-remote-resources-plugin:1.5:process (default) @ org.apache.sling.launchpad.testing
---
[INFO] 
[INFO] --- maven-resources-plugin:2.7:resources (default-resources) @ org.apache.sling.launchpad.testing
---
[INFO] Using 'UTF-8' encoding to copy filtered resources.
[INFO] skip non existing resourceDirectory <https://builds.apache.org/job/sling-org-apache-sling-launchpad-testing-10/ws/src/main/resources>
[INFO] Copying 3 resources
[INFO] Copying 3 resources
[INFO] 
[INFO] --- build-helper-maven-plugin:3.0.0:reserve-network-port (reserve-network-port) @ org.apache.sling.launchpad.testing
---
[INFO] Port assigned41000
[INFO] Reserved port 41000 for http.port
[INFO] Port assigned41001
[INFO] Reserved port 41001 for sling.control.port
[INFO] 
[INFO] --- maven-compiler-plugin:3.7.0:compile (default-compile) @ org.apache.sling.launchpad.testing
---
[INFO] No sources to compile
[INFO] 
[INFO] --- maven-resources-plugin:2.7:testResources (default-testResources) @ org.apache.sling.launchpad.testing
---
[INFO] Using 'UTF-8' encoding to copy filtered resources.
[INFO] Copying 1 resource
[INFO] Copying 3 resources
[INFO] Copying 3 resources
[INFO] 
[INFO] --- maven-compiler-plugin:3.7.0:testCompile (default-testCompile) @ org.apache.sling.launchpad.testing
---
[INFO] No sources to compile
[INFO] 
[INFO] --- maven-surefire-plugin:2.20.1:test (default-test) @ org.apache.sling.launchpad.testing
---
[INFO] 
[INFO] --- slingstart-maven-plugin:1.7.16:prepare-package (default-prepare-package) @ org.apache.sling.launchpad.testing
---
[JENKINS] Recording test results
[INFO] 
[INFO] --- slingstart-maven-plugin:1.7.16:attach-slingfeature (default-attach-slingfeature)
@ org.apache.sling.launchpad.testing ---
[INFO] 
[INFO] --- slingstart-maven-plugin:1.7.16:package (default-package) @ org.apache.sling.launchpad.testing
---
[INFO] Packaging standalone jar...
[INFO] Building zip: <https://builds.apache.org/job/sling-org-apache-sling-launchpad-testing-10/ws/target/org.apache.sling.launchpad.testing-11-SNAPSHOT.jar>
[INFO] 
[INFO] >>> maven-source-plugin:3.0.1:jar (attach-sources) > generate-sources @
org.apache.sling.launchpad.testing >>>
[INFO] 
[INFO] --- maven-enforcer-plugin:3.0.0-M1:enforce (enforce-property-values) @ org.apache.sling.launchpad.testing
---
[INFO] 
[INFO] --- maven-enforcer-plugin:3.0.0-M1:enforce (enforce-java) @ org.apache.sling.launchpad.testing
---
[INFO] 
[INFO] --- maven-enforcer-plugin:3.0.0-M1:enforce (ban-maven-scr-plugin) @ org.apache.sling.launchpad.testing
---
[WARNING] Failed to getClass for org.apache.maven.plugins.source.SourceJarMojo
[INFO] 
[INFO] <<< maven-source-plugin:3.0.1:jar (attach-sources) < generate-sources @
org.apache.sling.launchpad.testing <<<
[INFO] 
[INFO] --- maven-source-plugin:3.0.1:jar (attach-sources) @ org.apache.sling.launchpad.testing
---
[INFO] Building jar: <https://builds.apache.org/job/sling-org-apache-sling-launchpad-testing-10/ws/target/org.apache.sling.launchpad.testing-11-SNAPSHOT-sources.jar>
[INFO] 
[INFO] --- maven-site-plugin:3.5.1:attach-descriptor (attach-descriptor) @ org.apache.sling.launchpad.testing
---
[INFO] 
[INFO] --- slingstart-maven-plugin:1.7.16:start (start-container) @ org.apache.sling.launchpad.testing
---
[INFO] Using launchpad jar being generated as this project's primary artifact: '<https://builds.apache.org/job/sling-org-apache-sling-launchpad-testing-10/ws/target/org.apache.sling.launchpad.testing-11-SNAPSHOT.jar'!>
[INFO] Starting Launchpad _-41000...
-------------------------------------------------------------------
Slingstart application: <https://builds.apache.org/job/sling-org-apache-sling-launchpad-testing-10/ws/target/_-41000/org.apache.sling.launchpad.testing-11-SNAPSHOT.jar>
Main class: org.apache.sling.launchpad.app.Main
Listener Port: 34890
Arguments: [-p, 41000, -j, 41001]
-------------------------------------------------------------------
06.02.2018 04:31:45.375 *INFO * [main] Setting sling.home=sling (default)
06.02.2018 04:31:45.379 *INFO * [main] Starting Apache Sling in <https://builds.apache.org/job/sling-org-apache-sling-launchpad-testing-10/ws/target/_-41000/sling>
06.02.2018 04:31:45.383 *INFO * [main] Sling  Extension Lib Home : <https://builds.apache.org/job/sling-org-apache-sling-launchpad-testing-10/ws/target/_-41000/sling/ext>
06.02.2018 04:31:45.383 *INFO * [main] Checking launcher JAR in folder <https://builds.apache.org/job/sling-org-apache-sling-launchpad-testing-10/ws/target/_-41000/sling>
06.02.2018 04:31:45.397 *INFO * [main] Installing new launcher: jar:<https://builds.apache.org/job/sling-org-apache-sling-launchpad-testing-10/ws/target/_-41000/org.apache.sling.launchpad.testing-11-SNAPSHOT.jar!/resources/org.apache.sling.launchpad.base.jar,>
5.6.10.2_6_26 (org.apache.sling.launchpad.base.jar.1517891505396)
06.02.2018 04:31:45.398 *INFO * [main] Loading launcher class org.apache.sling.launchpad.base.app.MainDelegate
from org.apache.sling.launchpad.base.jar.1517891505396
06.02.2018 04:31:45.398 *INFO * [main] External Libs Home (ext) is null or does not exists.
06.02.2018 04:31:45.411 *INFO * [main] Setting sling.launchpad=<https://builds.apache.org/job/sling-org-apache-sling-launchpad-testing-10/ws/target/_-41000/sling>
06.02.2018 04:31:45.411 *INFO * [main] Setting org.osgi.service.http.port=41000
06.02.2018 04:31:45.411 *INFO * [main] Setting sling.control.socket=41001
06.02.2018 04:31:45.411 *INFO * [main] Starting launcher ...
06.02.2018 04:31:45.427 *INFO * [main] HTTP server port: 41000
WARNING: An illegal reflective access operation has occurred
WARNING: Illegal reflective access by org.apache.felix.framework.ext.ClassPathExtenderFactory$DefaultClassLoaderExtender
(<https://builds.apache.org/job/sling-org-apache-sling-launchpad-testing-10/ws/target/_-41000/sling/org.apache.sling.launchpad.base.jar.1517891505396)>
to method java.net.URLClassLoader.addURL(java.net.URL)
WARNING: Please consider reporting this to the maintainers of org.apache.felix.framework.ext.ClassPathExtenderFactory$DefaultClassLoaderExtender
WARNING: Use --illegal-access=warn to enable warnings of further illegal reflective access
operations
WARNING: All illegal access operations will be denied in a future release
06.02.2018 04:31:48.476 *INFO * [main] Startup completed
[INFO] Started Launchpad '_-41000' at port 41000 [run modes: null]
[INFO] 
[INFO] --- maven-failsafe-plugin:2.20.1:integration-test (default) @ org.apache.sling.launchpad.testing
---
[JENKINS] Recording test results
[JENKINS] Archiving disabled
[INFO] ------------------------------------------------------------------------
[INFO] BUILD FAILURE
[INFO] ------------------------------------------------------------------------
[INFO] Total time: 48.037 s
[INFO] Finished at: 2018-02-06T04:31:54+00:00
[JENKINS] Archiving disabled
[INFO] Final Memory: 41M/256M
[INFO] ------------------------------------------------------------------------
Feb 06, 2018 4:31:54 AM org.apache.tika.config.InitializableProblemHandler$3 handleInitializableProblem
WARNING: JBIG2ImageReader not loaded. jbig2 files will be ignored
See https://pdfbox.apache.org/2.0/dependencies.html#jai-image-io
for optional dependencies.
TIFFImageWriter not loaded. tiff files will not be processed
See https://pdfbox.apache.org/2.0/dependencies.html#jai-image-io
for optional dependencies.
J2KImageReader not loaded. JPEG2000 files will not be processed.
See https://pdfbox.apache.org/2.0/dependencies.html#jai-image-io
for optional dependencies.

Feb 06, 2018 4:31:54 AM org.apache.tika.config.InitializableProblemHandler$3 handleInitializableProblem
WARNING: org.xerial's sqlite-jdbc is not loaded.
Please provide the jar on your classpath to parse sqlite files.
See tika-parsers/pom.xml for the correct version.
Waiting for Jenkins to finish collecting data
[ERROR] Failed to execute goal org.apache.maven.plugins:maven-failsafe-plugin:2.20.1:integration-test
(default) on project org.apache.sling.launchpad.testing: Execution default of goal org.apache.maven.plugins:maven-failsafe-plugin:2.20.1:integration-test
failed. NullPointerException -> [Help 1]
[ERROR] 
[ERROR] To see the full stack trace of the errors, re-run Maven with the -e switch.
[ERROR] Re-run Maven using the -X switch to enable full debug logging.
[ERROR] 
[ERROR] For more information about the errors and possible solutions, please read the following
articles:
[ERROR] [Help 1] http://cwiki.apache.org/confluence/display/MAVEN/PluginExecutionException
channel stopped
Terminating launchpad _-41000
06.02.2018 04:31:58.607 *INFO * [Apache Sling Terminator] Java VM is shutting down
06.02.2018 04:31:58.616 *INFO * [Apache Sling Terminator] Stopping Apache Sling
Archiving artifacts
Recording test results
06.02.2018 04:32:01.516 *INFO * [Sling Notifier] Apache Sling has been stopped

Mime
View raw message