sling-commits mailing list archives

Site index · List index
Message view « Date » · « Thread »
Top « Date » · « Thread »
From Apache Jenkins Server <jenk...@builds.apache.org>
Subject Build failed in Jenkins: sling-org-apache-sling-pipes-1.8 #1331
Date Sun, 04 Feb 2018 18:24:10 GMT
See <https://builds.apache.org/job/sling-org-apache-sling-pipes-1.8/1331/display/redirect>

------------------------------------------
Started by timer
[EnvInject] - Loading node environment variables.
Building remotely on H31 (ubuntu xenial) in workspace <https://builds.apache.org/job/sling-org-apache-sling-pipes-1.8/ws/>
 > git rev-parse --is-inside-work-tree # timeout=10
Fetching changes from the remote Git repository
 > git config remote.origin.url https://github.com/apache/sling-org-apache-sling-pipes.git
# timeout=10
Fetching upstream changes from https://github.com/apache/sling-org-apache-sling-pipes.git
 > git --version # timeout=10
 > git fetch --tags --progress https://github.com/apache/sling-org-apache-sling-pipes.git
+refs/heads/*:refs/remotes/origin/*
 > git rev-parse origin/master^{commit} # timeout=10
Checking out Revision 4dff594b88cfb9e8925d16cb0bc861381c97e5a2 (origin/master)
 > git config core.sparsecheckout # timeout=10
 > git checkout -f 4dff594b88cfb9e8925d16cb0bc861381c97e5a2
Commit message: "[maven-release-plugin] prepare for next development iteration"
 > git rev-list 4dff594b88cfb9e8925d16cb0bc861381c97e5a2 # timeout=10
Parsing POMs
Established TCP socket on 36761
maven33-agent.jar already up to date
maven33-interceptor.jar already up to date
maven3-interceptor-commons.jar already up to date
[sling-org-apache-sling-pipes-1.8] $ /home/jenkins/tools/java/latest1.8/bin/java -Xmx2g -Xms256m
-cp /home/jenkins/jenkins-slave/maven33-agent.jar:/home/jenkins/tools/maven/apache-maven-3.3.9/boot/plexus-classworlds-2.5.2.jar:/home/jenkins/tools/maven/apache-maven-3.3.9/conf/logging
jenkins.maven3.agent.Maven33Main /home/jenkins/tools/maven/apache-maven-3.3.9 /home/jenkins/jenkins-slave/slave.jar
/home/jenkins/jenkins-slave/maven33-interceptor.jar /home/jenkins/jenkins-slave/maven3-interceptor-commons.jar
36761
         producer-436Exception in thread "main" java.lang.reflect.InvocationTargetException
	at sun.reflect.NativeMethodAccessorImpl.invoke0(Native Method)
	at sun.reflect.NativeMethodAccessorImpl.invoke(NativeMethodAccessorImpl.java:62)
	at sun.reflect.DelegatingMethodAccessorImpl.invoke(DelegatingMethodAccessorImpl.java:43)
	at java.lang.reflect.Method.invoke(Method.java:498)
	at jenkins.maven3.agent.Maven33Main.main(Maven33Main.java:135)
	at jenkins.maven3.agent.Maven33Main.main(Maven33Main.java:64)
Caused by: java.net.SocketException: Connection reset
	at java.net.SocketOutputStream.socketWrite(SocketOutputStream.java:115)
	at java.net.SocketOutputStream.write(SocketOutputStream.java:155)
	at jenkins.maven3.agent.RealFilter33OutputStream.write(RealFilter33OutputStream.java:46)
	at java.io.BufferedOutputStream.flushBuffer(BufferedOutputStream.java:82)
	at java.io.BufferedOutputStream.flush(BufferedOutputStream.java:140)
	at java.io.FilterOutputStream.flush(FilterOutputStream.java:140)
	at hudson.remoting.BinarySafeStream$2.flush(BinarySafeStream.java:305)
	at java.io.ObjectOutputStream$BlockDataOutputStream.flush(ObjectOutputStream.java:1823)
	at java.io.ObjectOutputStream.flush(ObjectOutputStream.java:719)
	at hudson.remoting.Capability.writePreamble(Capability.java:127)
	at hudson.remoting.ChannelBuilder.negotiate(ChannelBuilder.java:387)
	at hudson.remoting.ChannelBuilder.build(ChannelBuilder.java:353)
	at hudson.remoting.Launcher.main(Launcher.java:740)
	at hudson.remoting.Launcher.main(Launcher.java:721)
	at hudson.remoting.Launcher.main(Launcher.java:712)
	at hudson.remoting.Launcher.main(Launcher.java:708)
	... 6 more
	Suppressed: java.net.SocketException: Broken pipe (Write failed)
		at java.net.SocketOutputStream.socketWrite0(Native Method)
		at java.net.SocketOutputStream.socketWrite(SocketOutputStream.java:111)
		at java.net.SocketOutputStream.write(SocketOutputStream.java:155)
		at jenkins.maven3.agent.RealFilter33OutputStream.write(RealFilter33OutputStream.java:46)
		at java.io.BufferedOutputStream.flushBuffer(BufferedOutputStream.java:82)
		at java.io.BufferedOutputStream.flush(BufferedOutputStream.java:140)
		at java.io.FilterOutputStream.flush(FilterOutputStream.java:140)
		at hudson.remoting.BinarySafeStream$2.flush(BinarySafeStream.java:305)
		at java.io.ObjectOutputStream$BlockDataOutputStream.flush(ObjectOutputStream.java:1823)
		at java.io.ObjectOutputStream.flush(ObjectOutputStream.java:719)
		at hudson.remoting.Capability$1.close(Capability.java:121)
		at hudson.remoting.Capability.writePreamble(Capability.java:128)
		... 12 more
Build timed out (after 7 minutes). Marking the build as aborted.
ERROR: Failed to parse POMs
java.io.IOException: java.lang.InterruptedException
	at hudson.remoting.FastPipedInputStream.read(FastPipedInputStream.java:177)
	at java.io.BufferedInputStream.fill(BufferedInputStream.java:246)
	at java.io.BufferedInputStream.read(BufferedInputStream.java:265)
	at hudson.remoting.ChannelBuilder.negotiate(ChannelBuilder.java:406)
	at hudson.remoting.ChannelBuilder.build(ChannelBuilder.java:353)
	at hudson.slaves.Channels.forProcess(Channels.java:115)
	at hudson.maven.AbstractMavenProcessFactory.newProcess(AbstractMavenProcessFactory.java:294)
	at hudson.maven.ProcessCache.get(ProcessCache.java:236)
	at hudson.maven.MavenModuleSetBuild$MavenModuleSetBuildExecution.doRun(MavenModuleSetBuild.java:804)
	at hudson.model.AbstractBuild$AbstractBuildExecution.run(AbstractBuild.java:504)
	at hudson.model.Run.execute(Run.java:1724)
	at hudson.maven.MavenModuleSetBuild.run(MavenModuleSetBuild.java:543)
	at hudson.model.ResourceController.execute(ResourceController.java:97)
	at hudson.model.Executor.run(Executor.java:421)
Caused by: java.lang.InterruptedException
	at java.lang.Object.wait(Native Method)
	at hudson.remoting.FastPipedInputStream.read(FastPipedInputStream.java:175)
	... 13 more
Recording test results
ERROR: Step ?Publish JUnit test result report? failed: Test reports were found but none of
them are new. Did leafNodes run? 
For example, <https://builds.apache.org/job/sling-org-apache-sling-pipes-1.8/ws/target/surefire-reports/TEST-org.apache.sling.pipes.BasePipeTest.xml>
is 14 min old



Mime
View raw message