sling-commits mailing list archives

Site index · List index
Message view « Date » · « Thread »
Top « Date » · « Thread »
From Apache Jenkins Server <jenk...@builds.apache.org>
Subject Build failed in Jenkins: sling-org-apache-sling-launchpad-testing-10 #25
Date Fri, 23 Feb 2018 04:37:32 GMT
See <https://builds.apache.org/job/sling-org-apache-sling-launchpad-testing-10/25/display/redirect>

------------------------------------------
[...truncated 5.01 KB...]
WARNING: Illegal reflective access by hudson.remoting.RemoteClassLoader (file:/home/jenkins/jenkins-slave/slave.jar)
to method java.lang.ClassLoader.getClassLoadingLock(java.lang.String)
WARNING: Please consider reporting this to the maintainers of hudson.remoting.RemoteClassLoader
WARNING: Use --illegal-access=warn to enable warnings of further illegal reflective access
operations
WARNING: All illegal access operations will be denied in a future release
Executing Maven:  -B -f <https://builds.apache.org/job/sling-org-apache-sling-launchpad-testing-10/ws/pom.xml>
-Dmaven.repo.local=/home/jenkins/jenkins-slave/maven-repositories/1 -U clean verify
[INFO] Scanning for projects...
[INFO] Downloading: http://repository.apache.org/snapshots/org/apache/sling/org.apache.sling.launchpad.test-bundles/0.0.5-SNAPSHOT/maven-metadata.xml
[INFO] Downloaded: http://repository.apache.org/snapshots/org/apache/sling/org.apache.sling.launchpad.test-bundles/0.0.5-SNAPSHOT/maven-metadata.xml
(1019 B at 2.1 KB/sec)
[INFO] Downloading: http://repository.apache.org/snapshots/org/apache/sling/org.apache.sling.launchpad.test-bundles/0.0.5-SNAPSHOT/org.apache.sling.launchpad.test-bundles-0.0.5-20180223.042946-8.txt
[INFO] Downloaded: http://repository.apache.org/snapshots/org/apache/sling/org.apache.sling.launchpad.test-bundles/0.0.5-SNAPSHOT/org.apache.sling.launchpad.test-bundles-0.0.5-20180223.042946-8.txt
(2 KB at 3.8 KB/sec)
[INFO] Downloading: http://repository.apache.org/snapshots/org/apache/sling/org.apache.sling.starter/11-SNAPSHOT/maven-metadata.xml
[INFO] Downloaded: http://repository.apache.org/snapshots/org/apache/sling/org.apache.sling.starter/11-SNAPSHOT/maven-metadata.xml
(2 KB at 3.7 KB/sec)
[INFO] Downloading: http://repository.apache.org/snapshots/org/apache/sling/org.apache.sling.starter/11-SNAPSHOT/org.apache.sling.starter-11-20180223.043345-17-slingfeature.txt
[INFO] Downloaded: http://repository.apache.org/snapshots/org/apache/sling/org.apache.sling.starter/11-SNAPSHOT/org.apache.sling.starter-11-20180223.043345-17-slingfeature.txt
(31 KB at 52.3 KB/sec)
[INFO] Extended Maven classpath (scope 'provided') by the dependencies extracted from the
Sling model.
[INFO]                                                                         
[INFO] ------------------------------------------------------------------------
[INFO] Building Apache Sling Launchpad Testing 11-SNAPSHOT
[INFO] ------------------------------------------------------------------------
[INFO] Downloading: http://repository.apache.org/snapshots/org/apache/sling/org.apache.sling.launchpad.integration-tests/1.0.7-SNAPSHOT/maven-metadata.xml
[INFO] Downloaded: http://repository.apache.org/snapshots/org/apache/sling/org.apache.sling.launchpad.integration-tests/1.0.7-SNAPSHOT/maven-metadata.xml
(2 KB at 2.6 KB/sec)
[INFO] Downloading: http://repository.apache.org/snapshots/org/apache/sling/org.apache.sling.launchpad.integration-tests/1.0.7-SNAPSHOT/org.apache.sling.launchpad.integration-tests-1.0.7-20180223.043614-17.pom
[INFO] Downloaded: http://repository.apache.org/snapshots/org/apache/sling/org.apache.sling.launchpad.integration-tests/1.0.7-SNAPSHOT/org.apache.sling.launchpad.integration-tests-1.0.7-20180223.043614-17.pom
(12 KB at 30.7 KB/sec)
[INFO] Downloading: http://repository.apache.org/snapshots/org/apache/sling/org.apache.sling.junit.teleporter/1.0.17-SNAPSHOT/maven-metadata.xml
[INFO] Downloaded: http://repository.apache.org/snapshots/org/apache/sling/org.apache.sling.junit.teleporter/1.0.17-SNAPSHOT/maven-metadata.xml
(1021 B at 2.7 KB/sec)
[INFO] Downloading: http://repository.apache.org/snapshots/org/apache/sling/org.apache.sling.junit.teleporter/1.0.17-SNAPSHOT/org.apache.sling.junit.teleporter-1.0.17-20180223.042956-16.pom
[INFO] Downloaded: http://repository.apache.org/snapshots/org/apache/sling/org.apache.sling.junit.teleporter/1.0.17-SNAPSHOT/org.apache.sling.junit.teleporter-1.0.17-20180223.042956-16.pom
(6 KB at 14.4 KB/sec)
[INFO] Downloading: http://repository.apache.org/snapshots/org/apache/sling/org.apache.sling.launchpad.test-services/2.0.15-SNAPSHOT/maven-metadata.xml
[INFO] Downloaded: http://repository.apache.org/snapshots/org/apache/sling/org.apache.sling.launchpad.test-services/2.0.15-SNAPSHOT/maven-metadata.xml
(1 KB at 2.7 KB/sec)
[INFO] Downloading: http://repository.apache.org/snapshots/org/apache/sling/org.apache.sling.launchpad.test-services/2.0.15-SNAPSHOT/org.apache.sling.launchpad.test-services-2.0.15-20180219.062443-7.pom
[INFO] Downloaded: http://repository.apache.org/snapshots/org/apache/sling/org.apache.sling.launchpad.test-services/2.0.15-SNAPSHOT/org.apache.sling.launchpad.test-services-2.0.15-20180219.062443-7.pom
(10 KB at 26.7 KB/sec)
[INFO] Downloading: http://repository.apache.org/snapshots/org/apache/sling/org.apache.sling.launchpad.test-bundles/0.0.5-SNAPSHOT/org.apache.sling.launchpad.test-bundles-0.0.5-20180223.042946-8.pom
[INFO] Downloaded: http://repository.apache.org/snapshots/org/apache/sling/org.apache.sling.launchpad.test-bundles/0.0.5-SNAPSHOT/org.apache.sling.launchpad.test-bundles-0.0.5-20180223.042946-8.pom
(3 KB at 6.0 KB/sec)
[INFO] Downloading: http://repository.apache.org/snapshots/org/apache/sling/org.apache.sling.starter/11-SNAPSHOT/org.apache.sling.starter-11-20180223.043345-17.pom
[INFO] Downloaded: http://repository.apache.org/snapshots/org/apache/sling/org.apache.sling.starter/11-SNAPSHOT/org.apache.sling.starter-11-20180223.043345-17.pom
(8 KB at 19.3 KB/sec)
[INFO] Downloading: http://repository.apache.org/snapshots/org/apache/sling/org.apache.sling.launchpad.test-fragment/2.0.15-SNAPSHOT/maven-metadata.xml
[INFO] Downloaded: http://repository.apache.org/snapshots/org/apache/sling/org.apache.sling.launchpad.test-fragment/2.0.15-SNAPSHOT/maven-metadata.xml
(1 KB at 2.5 KB/sec)
[INFO] Downloading: http://repository.apache.org/snapshots/org/apache/sling/org.apache.sling.launchpad.test-fragment/2.0.15-SNAPSHOT/org.apache.sling.launchpad.test-fragment-2.0.15-20180223.043039-7.pom
[INFO] Downloaded: http://repository.apache.org/snapshots/org/apache/sling/org.apache.sling.launchpad.test-fragment/2.0.15-SNAPSHOT/org.apache.sling.launchpad.test-fragment-2.0.15-20180223.043039-7.pom
(3 KB at 7.9 KB/sec)
[INFO] Downloading: http://repository.apache.org/snapshots/org/apache/sling/org.apache.sling.launchpad.test-services-war/2.0.15-SNAPSHOT/maven-metadata.xml
[INFO] Downloaded: http://repository.apache.org/snapshots/org/apache/sling/org.apache.sling.launchpad.test-services-war/2.0.15-SNAPSHOT/maven-metadata.xml
(2 KB at 2.8 KB/sec)
[INFO] Downloading: http://repository.apache.org/snapshots/org/apache/sling/org.apache.sling.launchpad.test-services-war/2.0.15-SNAPSHOT/org.apache.sling.launchpad.test-services-war-2.0.15-20180222.210128-6.pom
[INFO] Downloaded: http://repository.apache.org/snapshots/org/apache/sling/org.apache.sling.launchpad.test-services-war/2.0.15-SNAPSHOT/org.apache.sling.launchpad.test-services-war-2.0.15-20180222.210128-6.pom
(6 KB at 15.1 KB/sec)
[INFO] Downloading: http://repository.apache.org/snapshots/org/apache/sling/org.apache.sling.auth.form/1.0.9-SNAPSHOT/maven-metadata.xml
[INFO] Downloaded: http://repository.apache.org/snapshots/org/apache/sling/org.apache.sling.auth.form/1.0.9-SNAPSHOT/maven-metadata.xml
(1018 B at 2.8 KB/sec)
[INFO] Downloading: http://repository.apache.org/snapshots/org/apache/sling/org.apache.sling.launchpad.content/2.0.13-SNAPSHOT/maven-metadata.xml
[INFO] Downloaded: http://repository.apache.org/snapshots/org/apache/sling/org.apache.sling.launchpad.content/2.0.13-SNAPSHOT/maven-metadata.xml
(1022 B at 2.7 KB/sec)
[INFO] Downloading: http://repository.apache.org/snapshots/org/apache/sling/org.apache.sling.launchpad.integration-tests/1.0.7-SNAPSHOT/org.apache.sling.launchpad.integration-tests-1.0.7-20180223.043614-17.jar
[INFO] Downloading: http://repository.apache.org/snapshots/org/apache/sling/org.apache.sling.junit.teleporter/1.0.17-SNAPSHOT/org.apache.sling.junit.teleporter-1.0.17-20180223.042956-16.jar
[INFO] Downloading: http://repository.apache.org/snapshots/org/apache/sling/org.apache.sling.launchpad.test-services-war/2.0.15-SNAPSHOT/org.apache.sling.launchpad.test-services-war-2.0.15-20180222.210128-6.war
[INFO] Downloading: http://repository.apache.org/snapshots/org/apache/sling/org.apache.sling.launchpad.test-services/2.0.15-SNAPSHOT/org.apache.sling.launchpad.test-services-2.0.15-20180219.062443-7.jar
[INFO] Downloading: http://repository.apache.org/snapshots/org/apache/sling/org.apache.sling.launchpad.test-fragment/2.0.15-SNAPSHOT/org.apache.sling.launchpad.test-fragment-2.0.15-20180223.043039-7.jar
[INFO] Downloaded: http://repository.apache.org/snapshots/org/apache/sling/org.apache.sling.launchpad.test-fragment/2.0.15-SNAPSHOT/org.apache.sling.launchpad.test-fragment-2.0.15-20180223.043039-7.jar
(9 KB at 24.2 KB/sec)
[INFO] Downloaded: http://repository.apache.org/snapshots/org/apache/sling/org.apache.sling.launchpad.test-services-war/2.0.15-SNAPSHOT/org.apache.sling.launchpad.test-services-war-2.0.15-20180222.210128-6.war
(14 KB at 36.7 KB/sec)
[INFO] Downloaded: http://repository.apache.org/snapshots/org/apache/sling/org.apache.sling.junit.teleporter/1.0.17-SNAPSHOT/org.apache.sling.junit.teleporter-1.0.17-20180223.042956-16.jar
(37 KB at 79.4 KB/sec)
[INFO] Downloaded: http://repository.apache.org/snapshots/org/apache/sling/org.apache.sling.launchpad.test-services/2.0.15-SNAPSHOT/org.apache.sling.launchpad.test-services-2.0.15-20180219.062443-7.jar
(202 KB at 323.0 KB/sec)
[INFO] Downloaded: http://repository.apache.org/snapshots/org/apache/sling/org.apache.sling.launchpad.integration-tests/1.0.7-SNAPSHOT/org.apache.sling.launchpad.integration-tests-1.0.7-20180223.043614-17.jar
(485 KB at 603.5 KB/sec)
[INFO] 
[INFO] --- maven-clean-plugin:3.0.0:clean (default-clean) @ org.apache.sling.launchpad.testing
---
[INFO] 
[INFO] --- maven-enforcer-plugin:3.0.0-M1:enforce (enforce-property-values) @ org.apache.sling.launchpad.testing
---
[INFO] 
[INFO] --- maven-enforcer-plugin:3.0.0-M1:enforce (enforce-java) @ org.apache.sling.launchpad.testing
---
[INFO] 
[INFO] --- maven-enforcer-plugin:3.0.0-M1:enforce (ban-maven-scr-plugin) @ org.apache.sling.launchpad.testing
---
[INFO] 
[INFO] --- maven-remote-resources-plugin:1.5:process (process-resource-bundles) @ org.apache.sling.launchpad.testing
---
[INFO] 
[INFO] --- maven-remote-resources-plugin:1.5:process (default) @ org.apache.sling.launchpad.testing
---
[INFO] 
[INFO] --- maven-resources-plugin:2.7:resources (default-resources) @ org.apache.sling.launchpad.testing
---
[INFO] Using 'UTF-8' encoding to copy filtered resources.
[INFO] skip non existing resourceDirectory <https://builds.apache.org/job/sling-org-apache-sling-launchpad-testing-10/ws/src/main/resources>
[INFO] Copying 3 resources
[INFO] Copying 3 resources
[INFO] 
[INFO] --- build-helper-maven-plugin:3.0.0:reserve-network-port (reserve-network-port) @ org.apache.sling.launchpad.testing
---
[INFO] Port assigned41000
[INFO] Reserved port 41000 for http.port
[INFO] Port assigned41001
[INFO] Reserved port 41001 for sling.control.port
[INFO] 
[INFO] --- maven-compiler-plugin:3.7.0:compile (default-compile) @ org.apache.sling.launchpad.testing
---
[INFO] No sources to compile
[INFO] 
[INFO] --- maven-resources-plugin:2.7:testResources (default-testResources) @ org.apache.sling.launchpad.testing
---
[INFO] Using 'UTF-8' encoding to copy filtered resources.
[INFO] Copying 1 resource
[INFO] Copying 3 resources
[INFO] Copying 3 resources
[INFO] 
[INFO] --- maven-compiler-plugin:3.7.0:testCompile (default-testCompile) @ org.apache.sling.launchpad.testing
---
[INFO] No sources to compile
[INFO] 
[INFO] --- maven-surefire-plugin:2.20.1:test (default-test) @ org.apache.sling.launchpad.testing
---
[JENKINS] Recording test results[INFO] 
[INFO] --- slingstart-maven-plugin:1.7.16:prepare-package (default-prepare-package) @ org.apache.sling.launchpad.testing
---

[INFO] 
[INFO] --- slingstart-maven-plugin:1.7.16:attach-slingfeature (default-attach-slingfeature)
@ org.apache.sling.launchpad.testing ---
[INFO] 
[INFO] --- slingstart-maven-plugin:1.7.16:package (default-package) @ org.apache.sling.launchpad.testing
---
[INFO] Packaging standalone jar...
[INFO] Building zip: <https://builds.apache.org/job/sling-org-apache-sling-launchpad-testing-10/ws/target/org.apache.sling.launchpad.testing-11-SNAPSHOT.jar>
[INFO] 
[INFO] >>> maven-source-plugin:3.0.1:jar (attach-sources) > generate-sources @
org.apache.sling.launchpad.testing >>>
[INFO] 
[INFO] --- maven-enforcer-plugin:3.0.0-M1:enforce (enforce-property-values) @ org.apache.sling.launchpad.testing
---
[INFO] 
[INFO] --- maven-enforcer-plugin:3.0.0-M1:enforce (enforce-java) @ org.apache.sling.launchpad.testing
---
[INFO] 
[INFO] --- maven-enforcer-plugin:3.0.0-M1:enforce (ban-maven-scr-plugin) @ org.apache.sling.launchpad.testing
---
[WARNING] Failed to getClass for org.apache.maven.plugins.source.SourceJarMojo
[INFO] 
[INFO] <<< maven-source-plugin:3.0.1:jar (attach-sources) < generate-sources @
org.apache.sling.launchpad.testing <<<
[INFO] 
[INFO] --- maven-source-plugin:3.0.1:jar (attach-sources) @ org.apache.sling.launchpad.testing
---
[INFO] Building jar: <https://builds.apache.org/job/sling-org-apache-sling-launchpad-testing-10/ws/target/org.apache.sling.launchpad.testing-11-SNAPSHOT-sources.jar>
[INFO] 
[INFO] --- maven-site-plugin:3.5.1:attach-descriptor (attach-descriptor) @ org.apache.sling.launchpad.testing
---
[INFO] 
[INFO] --- slingstart-maven-plugin:1.7.16:start (start-container) @ org.apache.sling.launchpad.testing
---
[INFO] Using launchpad jar being generated as this project's primary artifact: '<https://builds.apache.org/job/sling-org-apache-sling-launchpad-testing-10/ws/target/org.apache.sling.launchpad.testing-11-SNAPSHOT.jar'!>
[INFO] Starting Launchpad _-41000...
-------------------------------------------------------------------
Slingstart application: <https://builds.apache.org/job/sling-org-apache-sling-launchpad-testing-10/ws/target/_-41000/org.apache.sling.launchpad.testing-11-SNAPSHOT.jar>
Main class: org.apache.sling.launchpad.app.Main
Listener Port: 53195
Arguments: [-p, 41000, -j, 41001]
-------------------------------------------------------------------
23.02.2018 04:37:21.953 *INFO * [main] Setting sling.home=sling (default)
23.02.2018 04:37:21.956 *INFO * [main] Starting Apache Sling in <https://builds.apache.org/job/sling-org-apache-sling-launchpad-testing-10/ws/target/_-41000/sling>
23.02.2018 04:37:21.958 *INFO * [main] Sling  Extension Lib Home : <https://builds.apache.org/job/sling-org-apache-sling-launchpad-testing-10/ws/target/_-41000/sling/ext>
23.02.2018 04:37:21.959 *INFO * [main] Checking launcher JAR in folder <https://builds.apache.org/job/sling-org-apache-sling-launchpad-testing-10/ws/target/_-41000/sling>
23.02.2018 04:37:21.976 *INFO * [main] Installing new launcher: jar:<https://builds.apache.org/job/sling-org-apache-sling-launchpad-testing-10/ws/target/_-41000/org.apache.sling.launchpad.testing-11-SNAPSHOT.jar!/resources/org.apache.sling.launchpad.base.jar,>
5.6.10.2_6_26 (org.apache.sling.launchpad.base.jar.1519360641975)
23.02.2018 04:37:21.978 *INFO * [main] Loading launcher class org.apache.sling.launchpad.base.app.MainDelegate
from org.apache.sling.launchpad.base.jar.1519360641975
23.02.2018 04:37:21.979 *INFO * [main] External Libs Home (ext) is null or does not exists.
23.02.2018 04:37:22.006 *INFO * [main] Setting sling.launchpad=<https://builds.apache.org/job/sling-org-apache-sling-launchpad-testing-10/ws/target/_-41000/sling>
23.02.2018 04:37:22.007 *INFO * [main] Setting org.osgi.service.http.port=41000
23.02.2018 04:37:22.007 *INFO * [main] Setting sling.control.socket=41001
23.02.2018 04:37:22.007 *INFO * [main] Starting launcher ...
23.02.2018 04:37:22.025 *INFO * [main] HTTP server port: 41000
WARNING: An illegal reflective access operation has occurred
WARNING: Illegal reflective access by org.apache.felix.framework.ext.ClassPathExtenderFactory$DefaultClassLoaderExtender
(<https://builds.apache.org/job/sling-org-apache-sling-launchpad-testing-10/ws/target/_-41000/sling/org.apache.sling.launchpad.base.jar.1519360641975)>
to method java.net.URLClassLoader.addURL(java.net.URL)
WARNING: Please consider reporting this to the maintainers of org.apache.felix.framework.ext.ClassPathExtenderFactory$DefaultClassLoaderExtender
WARNING: Use --illegal-access=warn to enable warnings of further illegal reflective access
operations
WARNING: All illegal access operations will be denied in a future release
23.02.2018 04:37:23.088 *INFO* [OsgiInstallerImpl] org.apache.sling.installer.core.impl.OsgiInstallerImpl
Apache Sling OSGi Installer Service started.
23.02.2018 04:37:23.094 *INFO* [FelixStartLevel] org.apache.sling.settings.impl.SlingSettingsServiceImpl
Read Sling ID null from file <https://builds.apache.org/job/sling-org-apache-sling-launchpad-testing-10/ws/target/_-41000/sling/felix/bundle6/data/sling.id.file>
23.02.2018 04:37:23.101 *INFO* [FelixStartLevel] org.apache.sling.settings.impl.SlingSettingsServiceImpl
Created new Sling ID b225f9ce-85a2-4733-a144-beda2563b825
23.02.2018 04:37:23.107 *INFO* [FelixStartLevel] org.apache.sling.settings.impl.SlingSettingsServiceImpl
Active run modes: [oak_tar]
23.02.2018 04:37:23.168 *INFO* [FelixStartLevel] org.apache.sling.commons.logservice Service
[org.apache.sling.commons.logservice.internal.LogServiceFactory,19, [org.osgi.service.log.LogService]]
ServiceEvent REGISTERED
23.02.2018 04:37:23.169 *INFO* [FelixStartLevel] org.apache.sling.commons.logservice Service
[org.apache.sling.commons.logservice.internal.LogReaderServiceFactory,20, [org.osgi.service.log.LogReaderService]]
ServiceEvent REGISTERED
23.02.2018 04:37:23.169 *INFO* [FelixStartLevel] org.apache.sling.commons.logservice BundleEvent
STARTED
23.02.2018 04:37:23.183 *INFO* [FelixStartLevel] org.apache.sling.launchpad.installer BundleEvent
RESOLVED
23.02.2018 04:37:23.185 *INFO* [FelixStartLevel] org.apache.sling.launchpad.installer BundleEvent
STARTING
23.02.2018 04:37:23.188 *INFO* [FelixStartLevel] org.apache.sling.launchpad.installer Service
[Apache Sling Launchpad Startup Listener,21, [org.apache.sling.installer.api.event.InstallationListener]]
ServiceEvent REGISTERED
23.02.2018 04:37:23.189 *INFO* [FelixStartLevel] org.apache.sling.launchpad.installer.impl.LaunchpadConfigInstaller
Activating launchpad config installer, configuration path=resources/config, install path=resources/install
23.02.2018 04:37:23.632 *INFO* [FelixStartLevel] org.apache.sling.launchpad.installer.impl.LaunchpadConfigInstaller
183 resources registered with OsgiInstaller
23.02.2018 04:37:23.633 *INFO* [FelixStartLevel] org.apache.sling.launchpad.installer BundleEvent
STARTED
23.02.2018 04:37:23.636 *INFO* [FelixStartLevel] org.apache.felix.eventadmin BundleEvent RESOLVED
23.02.2018 04:37:23.646 *INFO* [FelixStartLevel] org.apache.felix.eventadmin BundleEvent STARTING
23.02.2018 04:37:23.692 *INFO* [FelixStartLevel] org.apache.felix.eventadmin Service [22,
[org.osgi.service.event.EventAdmin]] ServiceEvent REGISTERED
23.02.2018 04:37:23.694 *INFO* [FelixStartLevel] org.apache.felix.eventadmin Service [org.apache.felix.eventadmin.impl.EventAdmin,23,
[org.osgi.service.cm.ManagedService]] ServiceEvent REGISTERED
23.02.2018 04:37:23.694 *INFO* [FelixStartLevel] org.apache.felix.eventadmin BundleEvent STARTED
23.02.2018 04:37:23.699 *INFO* [FelixStartLevel] log4j.over.slf4j BundleEvent RESOLVED
23.02.2018 04:37:23.700 *INFO* [FelixStartLevel] log4j.over.slf4j BundleEvent STARTING
23.02.2018 04:37:23.700 *INFO* [FelixStartLevel] log4j.over.slf4j BundleEvent STARTED
23.02.2018 04:37:23.712 *INFO* [FelixStartLevel] org.apache.sling.javax.activation BundleEvent
RESOLVED
23.02.2018 04:37:23.716 *INFO* [FelixStartLevel] org.apache.sling.javax.activation BundleEvent
STARTING
23.02.2018 04:37:23.722 *INFO* [FelixStartLevel] org.apache.sling.javax.activation BundleEvent
STARTED
23.02.2018 04:37:23.725 *INFO* [FelixStartLevel] jcl.over.slf4j BundleEvent RESOLVED
23.02.2018 04:37:23.725 *INFO* [FelixStartLevel] jcl.over.slf4j BundleEvent STARTING
23.02.2018 04:37:23.725 *INFO* [FelixStartLevel] jcl.over.slf4j BundleEvent STARTED
23.02.2018 04:37:23.730 *INFO* [FelixStartLevel] org.apache.sling.commons.log BundleEvent
STARTING
23.02.2018 04:37:23.794 *INFO* [FelixStartLevel] org.apache.sling.commons.log Service [org.apache.sling.commons.log.LogManager,24,
[org.osgi.service.cm.ManagedService]] ServiceEvent REGISTERED
23.02.2018 04:37:23.805 *INFO* [FelixStartLevel] org.apache.sling.commons.log Service [org.apache.sling.commons.log.LogManager.factory.writer,25,
[org.osgi.service.cm.ManagedServiceFactory]] ServiceEvent REGISTERED
23.02.2018 04:37:23.808 *INFO* [FelixStartLevel] org.apache.sling.commons.log Service [org.apache.sling.commons.log.LogManager.factory.config,26,
[org.osgi.service.cm.ManagedServiceFactory]] ServiceEvent REGISTERED
23.02.2018 04:37:23.821 *INFO* [FelixStartLevel] org.apache.sling.commons.log Service [Sling
Log Panel Support,27, [org.apache.sling.commons.log.logback.webconsole.LogPanel]] ServiceEvent
REGISTERED
23.02.2018 04:37:23.822 *INFO* [FelixStartLevel] org.apache.sling.commons.log Service [Sling
Log Configuration Printer,28, [org.apache.sling.commons.log.logback.internal.SlingConfigurationPrinter]]
ServiceEvent REGISTERED
23.02.2018 04:37:23.834 *INFO* [FelixStartLevel] org.apache.sling.commons.log Service [Sling
Log Reset Event Handler,29, [org.osgi.service.event.EventHandler]] ServiceEvent REGISTERED
23.02.2018 04:37:23.877 *INFO* [OsgiInstallerImpl] org.apache.sling.audit.osgi.installer Installed
configuration integrationTestsConfig from resource TaskResource(url=launchpad:resources/config/integrationTestsConfig.config,
entity=config:integrationTestsConfig, state=INSTALL, attributes=[org.apache.sling.installer.api.tasks.ResourceTransformer=:17:,
service.pid=integrationTestsConfig], digest=62e00d7a351e7e38160465088f77a6ab)
23.02.2018 04:37:23.900 *INFO * [main] Startup completed
23.02.2018 04:37:23.940 *INFO* [OsgiInstallerImpl] org.apache.sling.audit.osgi.installer Installed
configuration org.apache.sling.jcr.base.internal.LoginAdminWhitelist.fragment.d69a970a-d548-416a-8a0a-c2c62e369f21
from resource TaskResource(url=launchpad:resources/config/org.apache.sling.jcr.base.internal.LoginAdminWhitelist.fragment-sling.config,
entity=config:org.apache.sling.jcr.base.internal.LoginAdminWhitelist.fragment.sling, state=INSTALL,
attributes=[org.apache.sling.installer.api.tasks.ResourceTransformer=:17:, service.factoryPid=org.apache.sling.jcr.base.internal.LoginAdminWhitelist.fragment,
service.pid=sling], digest=b57bfd8d9f92019f6166ea7005255d38)
23.02.2018 04:37:23.942 *INFO* [OsgiInstallerImpl] org.apache.sling.audit.osgi.installer Installed
configuration org.apache.sling.jcr.davex.impl.servlets.SlingDavExServlet from resource TaskResource(url=launchpad:resources/config/org.apache.sling.jcr.davex.impl.servlets.SlingDavExServlet.config,
entity=config:org.apache.sling.jcr.davex.impl.servlets.SlingDavExServlet, state=INSTALL, attributes=[org.apache.sling.installer.api.tasks.ResourceTransformer=:17:,
service.pid=org.apache.sling.jcr.davex.impl.servlets.SlingDavExServlet], digest=ee3357fb8cc76c8d77dfa8b61bc29ef3)
23.02.2018 04:37:23.947 *INFO* [OsgiInstallerImpl] org.apache.sling.audit.osgi.installer Installed
configuration org.apache.sling.jcr.repoinit.impl.RepositoryInitializer from resource TaskResource(url=launchpad:resources/config/org.apache.sling.jcr.repoinit.impl.RepositoryInitializer.config,
entity=config:org.apache.sling.jcr.repoinit.impl.RepositoryInitializer, state=INSTALL, attributes=[org.apache.sling.installer.api.tasks.ResourceTransformer=:17:,
service.pid=org.apache.sling.jcr.repoinit.impl.RepositoryInitializer], digest=62590adee787f806d60b246345ae4991)
23.02.2018 04:37:23.956 *INFO* [OsgiInstallerImpl] org.apache.sling.audit.osgi.installer Installed
configuration org.apache.sling.serviceusermapping.impl.ServiceUserMapperImpl.amended.dcd9d96f-bebe-4e05-a558-ad1020f17ee1
from resource TaskResource(url=launchpad:resources/config/org.apache.sling.serviceusermapping.impl.ServiceUserMapperImpl.amended-jcr-resource.config,
entity=config:org.apache.sling.serviceusermapping.impl.ServiceUserMapperImpl.amended.jcr-resource,
state=INSTALL, attributes=[org.apache.sling.installer.api.tasks.ResourceTransformer=:17:,
service.factoryPid=org.apache.sling.serviceusermapping.impl.ServiceUserMapperImpl.amended,
service.pid=jcr-resource], digest=8b9c2b1535ffb961711fa342f873d589)
23.02.2018 04:37:23.963 *INFO* [OsgiInstallerImpl] org.apache.sling.audit.osgi.installer Installed
configuration org.apache.sling.serviceusermapping.impl.ServiceUserMapperImpl.amended.97d5018b-8861-4a04-b4e7-af9c12f36e55
from resource TaskResource(url=launchpad:resources/config/org.apache.sling.serviceusermapping.impl.ServiceUserMapperImpl.amended-observation.config,
entity=config:org.apache.sling.serviceusermapping.impl.ServiceUserMapperImpl.amended.observation,
state=INSTALL, attributes=[org.apache.sling.installer.api.tasks.ResourceTransformer=:17:,
service.factoryPid=org.apache.sling.serviceusermapping.impl.ServiceUserMapperImpl.amended,
service.pid=observation], digest=b358fca04fc5775b5fee0983520f157b)
23.02.2018 04:37:23.964 *INFO* [OsgiInstallerImpl] org.apache.sling.audit.osgi.installer Installed
configuration org.apache.sling.serviceusermapping.impl.ServiceUserMapperImpl.amended.2e478e03-abea-46a1-927c-0fae272511be
from resource TaskResource(url=launchpad:resources/config/org.apache.sling.serviceusermapping.impl.ServiceUserMapperImpl.amended-resourceresolver.config,
entity=config:org.apache.sling.serviceusermapping.impl.ServiceUserMapperImpl.amended.resourceresolver,
state=INSTALL, attributes=[org.apache.sling.installer.api.tasks.ResourceTransformer=:17:,
service.factoryPid=org.apache.sling.serviceusermapping.impl.ServiceUserMapperImpl.amended,
service.pid=resourceresolver], digest=d317bcbc20315e21bdbb0480199d7a55)
23.02.2018 04:37:23.966 *INFO* [OsgiInstallerImpl] org.apache.sling.audit.osgi.installer Installed
configuration org.apache.sling.serviceusermapping.impl.ServiceUserMapperImpl.amended.38a0e66a-0d33-4aad-a09d-deda71fa28ca
from resource TaskResource(url=launchpad:resources/config/org.apache.sling.serviceusermapping.impl.ServiceUserMapperImpl.amended-scripting.config,
entity=config:org.apache.sling.serviceusermapping.impl.ServiceUserMapperImpl.amended.scripting,
state=INSTALL, attributes=[org.apache.sling.installer.api.tasks.ResourceTransformer=:17:,
service.factoryPid=org.apache.sling.serviceusermapping.impl.ServiceUserMapperImpl.amended,
service.pid=scripting], digest=479bf62d1c800aa03dba13706319afd1)
[INFO] Started Launchpad '_-41000' at port 41000 [run modes: null]
[INFO] 
[INFO] --- maven-failsafe-plugin:2.20.1:integration-test (default) @ org.apache.sling.launchpad.testing
---
Feb 23, 2018 4:37:26 AM org.apache.tika.config.InitializableProblemHandler$3 handleInitializableProblem
WARNING: JBIG2ImageReader not loaded. jbig2 files will be ignored
See https://pdfbox.apache.org/2.0/dependencies.html#jai-image-io
for optional dependencies.
TIFFImageWriter not loaded. tiff files will not be processed
See https://pdfbox.apache.org/2.0/dependencies.html#jai-image-io
for optional dependencies.
J2KImageReader not loaded. JPEG2000 files will not be processed.
See https://pdfbox.apache.org/2.0/dependencies.html#jai-image-io
for optional dependencies.

Feb 23, 2018 4:37:26 AM org.apache.tika.config.InitializableProblemHandler$3 handleInitializableProblem
WARNING: org.xerial's sqlite-jdbc is not loaded.
Please provide the jar on your classpath to parse sqlite files.
See tika-parsers/pom.xml for the correct version.
[JENKINS] Recording test results
[JENKINS] Archiving disabled
[JENKINS] Archiving disabled[INFO] ------------------------------------------------------------------------
[INFO] BUILD FAILURE
[INFO] ------------------------------------------------------------------------
[INFO] Total time: 33.690 s
[INFO] Finished at: 2018-02-23T04:37:28+00:00

[INFO] Final Memory: 41M/256M
[INFO] ------------------------------------------------------------------------
Waiting for Jenkins to finish collecting data
[ERROR] Failed to execute goal org.apache.maven.plugins:maven-failsafe-plugin:2.20.1:integration-test
(default) on project org.apache.sling.launchpad.testing: Execution default of goal org.apache.maven.plugins:maven-failsafe-plugin:2.20.1:integration-test
failed. NullPointerException -> [Help 1]
[ERROR] 
[ERROR] To see the full stack trace of the errors, re-run Maven with the -e switch.
[ERROR] Re-run Maven using the -X switch to enable full debug logging.
[ERROR] 
[ERROR] For more information about the errors and possible solutions, please read the following
articles:
[ERROR] [Help 1] http://cwiki.apache.org/confluence/display/MAVEN/PluginExecutionException
channel stopped
Terminating launchpad _-41000
23.02.2018 04:37:29.855 *INFO * [Apache Sling Terminator] Java VM is shutting down
23.02.2018 04:37:29.857 *INFO * [Apache Sling Terminator] Stopping Apache Sling
Archiving artifacts
ERROR: Failed to archive {target/_-41000/sling/logs/request.log=target/_-41000/sling/logs/request.log,
target/_-41000/sling/logs/access.log=target/_-41000/sling/logs/access.log, target/_-41000/sling/logs/error.log=target/_-41000/sling/logs/error.log}
due to internal error; falling back to full archiving
java.lang.IllegalStateException: checksum mismatch after transfer (3617285710243836464 vs.
1181033355); /x1/jenkins/jenkins-home/jobs/sling-org-apache-sling-launchpad-testing-10/builds/25/archive/target/_-41000/sling/logs/error.log
may be corrupted
	at jsync.protocol.FileSequenceReader.read(FileSequenceReader.java:45)
	at com.cloudbees.jenkins.plugins.jsync.archiver.JSyncArtifactManager.remoteSync(JSyncArtifactManager.java:158)
	at com.cloudbees.jenkins.plugins.jsync.archiver.JSyncArtifactManager.archive(JSyncArtifactManager.java:76)
	at hudson.tasks.ArtifactArchiver.perform(ArtifactArchiver.java:245)
	at hudson.tasks.BuildStepCompatibilityLayer.perform(BuildStepCompatibilityLayer.java:81)
	at hudson.tasks.BuildStepMonitor$1.perform(BuildStepMonitor.java:20)
	at hudson.model.AbstractBuild$AbstractBuildExecution.perform(AbstractBuild.java:744)
	at hudson.model.AbstractBuild$AbstractBuildExecution.performAllBuildSteps(AbstractBuild.java:690)
	at hudson.maven.MavenModuleSetBuild$MavenModuleSetBuildExecution.post2(MavenModuleSetBuild.java:1073)
	at hudson.model.AbstractBuild$AbstractBuildExecution.post(AbstractBuild.java:635)
	at hudson.model.Run.execute(Run.java:1749)
	at hudson.maven.MavenModuleSetBuild.run(MavenModuleSetBuild.java:543)
	at hudson.model.ResourceController.execute(ResourceController.java:97)
	at hudson.model.Executor.run(Executor.java:429)
Recording test results
23.02.2018 04:37:30.993 *INFO * [Sling Notifier] Apache Sling has been stopped

Mime
View raw message