sling-commits mailing list archives

Site index · List index
Message view « Date » · « Thread »
Top « Date » · « Thread »
From Apache Jenkins Server <>
Subject Build failed in Jenkins: sling-org-apache-sling-scripting-groovy-1.8 #36
Date Fri, 02 Feb 2018 15:42:50 GMT
See <>

Started by timer
[EnvInject] - Loading node environment variables.
Building remotely on ubuntu-6 (ubuntu trusty) in workspace <>
 > git rev-parse --is-inside-work-tree # timeout=10
Fetching changes from the remote Git repository
 > git config remote.origin.url
# timeout=10
Fetching upstream changes from
 > git --version # timeout=10
 > git fetch --tags --progress
 > git rev-parse origin/master^{commit} # timeout=10
Checking out Revision 9ee3efb3c701d21280fa0632b78a767599a0d322 (origin/master)
 > git config core.sparsecheckout # timeout=10
 > git checkout -f 9ee3efb3c701d21280fa0632b78a767599a0d322
Commit message: "SLING-7353 Update to Sling Parent 33"
 > git rev-list 9ee3efb3c701d21280fa0632b78a767599a0d322 # timeout=10
Parsing POMs
Established TCP socket on 59243
maven33-agent.jar already up to date
maven33-interceptor.jar already up to date
maven3-interceptor-commons.jar already up to date
[sling-org-apache-sling-scripting-groovy-1.8] $ /home/jenkins/tools/java/latest1.8/bin/java
-Xmx2g -Xms256m -cp /home/jenkins/jenkins-slave/maven33-agent.jar:/home/jenkins/tools/maven/apache-maven-3.3.9/boot/plexus-classworlds-2.5.2.jar:/home/jenkins/tools/maven/apache-maven-3.3.9/conf/logging
jenkins.maven3.agent.Maven33Main /home/jenkins/tools/maven/apache-maven-3.3.9 /home/jenkins/jenkins-slave/slave.jar
/home/jenkins/jenkins-slave/maven33-interceptor.jar /home/jenkins/jenkins-slave/maven3-interceptor-commons.jar
<===[JENKINS REMOTING CAPACITY]===>   channel started
Executing Maven:  -B -f <>
-Dmaven.repo.local=/home/jenkins/jenkins-slave/maven-repositories/0 -U clean deploy
[INFO] Scanning for projects...
[INFO] ------------------------------------------------------------------------
[INFO] Building Apache Sling Scripting Groovy 1.0.3-SNAPSHOT
[INFO] ------------------------------------------------------------------------
[INFO] Downloading:
[INFO] Downloaded:
(1016 B at 2.4 KB/sec)
[INFO] Downloading:
[INFO] Downloaded:
(6 KB at 17.2 KB/sec)
[INFO] Downloading:
[INFO] Downloading:
[INFO] Downloading:
[INFO] Downloaded:
(17 KB at 64.5 KB/sec)
[INFO] Downloading:
[INFO] Downloaded:
(17 KB at 744.6 KB/sec)
[INFO] Downloading:
[INFO] Downloaded:
(17 KB at 539.6 KB/sec)
[JENKINS] Archiving disabled
[JENKINS] Archiving disabled
[INFO] ------------------------------------------------------------------------
[INFO] ------------------------------------------------------------------------
[INFO] Total time: 11.432 s
[INFO] Finished at: 2018-02-02T15:42:48+00:00
[INFO] Final Memory: 14M/245M
[INFO] ------------------------------------------------------------------------
Waiting for Jenkins to finish collecting data
[ERROR] Failed to execute goal on project Could not resolve
dependencies for project
Failed to collect dependencies at
Failed to read artifact descriptor for
Could not find artifact in Nexus (
-> [Help 1]
[ERROR] To see the full stack trace of the errors, re-run Maven with the -e switch.
[ERROR] Re-run Maven using the -X switch to enable full debug logging.
[ERROR] For more information about the errors and possible solutions, please read the following
[ERROR] [Help 1]
channel stopped
Recording test results

View raw message