sling-commits mailing list archives

Site index · List index
Message view « Date » · « Thread »
Top « Date » · « Thread »
From Apache Jenkins Server <jenk...@builds.apache.org>
Subject Build failed in Jenkins: sling-org-apache-sling-scripting-sightly-1.8 #38
Date Thu, 22 Feb 2018 22:06:46 GMT
See <https://builds.apache.org/job/sling-org-apache-sling-scripting-sightly-1.8/38/display/redirect>

------------------------------------------
Started by timer
[EnvInject] - Loading node environment variables.
Building remotely on ubuntu-6 (ubuntu trusty) in workspace <https://builds.apache.org/job/sling-org-apache-sling-scripting-sightly-1.8/ws/>
 > git rev-parse --is-inside-work-tree # timeout=10
Fetching changes from the remote Git repository
 > git config remote.origin.url https://github.com/apache/sling-org-apache-sling-scripting-sightly.git
# timeout=10
Fetching upstream changes from https://github.com/apache/sling-org-apache-sling-scripting-sightly.git
 > git --version # timeout=10
 > git fetch --tags --progress https://github.com/apache/sling-org-apache-sling-scripting-sightly.git
+refs/heads/*:refs/remotes/origin/*
 > git rev-parse origin/master^{commit} # timeout=10
Checking out Revision cd7d67e66f624c66fe88dd208c4d2b8f7e85c8ec (origin/master)
 > git config core.sparsecheckout # timeout=10
 > git checkout -f cd7d67e66f624c66fe88dd208c4d2b8f7e85c8ec
Commit message: "[maven-release-plugin] prepare for next development iteration"
 > git rev-list --no-walk cd7d67e66f624c66fe88dd208c4d2b8f7e85c8ec # timeout=10
Parsing POMs
Established TCP socket on 43075
maven33-agent.jar already up to date
maven33-interceptor.jar already up to date
maven3-interceptor-commons.jar already up to date
[sling-org-apache-sling-scripting-sightly-1.8] $ /home/jenkins/tools/java/latest1.8/bin/java
-Xmx2g -Xms256m -cp /home/jenkins/jenkins-slave/maven33-agent.jar:/home/jenkins/tools/maven/apache-maven-3.3.9/boot/plexus-classworlds-2.5.2.jar:/home/jenkins/tools/maven/apache-maven-3.3.9/conf/logging
jenkins.maven3.agent.Maven33Main /home/jenkins/tools/maven/apache-maven-3.3.9 /home/jenkins/jenkins-slave/slave.jar
/home/jenkins/jenkins-slave/maven33-interceptor.jar /home/jenkins/jenkins-slave/maven3-interceptor-commons.jar
43075
<===[JENKINS REMOTING CAPACITY]===>   channel started
Executing Maven:  -B -f <https://builds.apache.org/job/sling-org-apache-sling-scripting-sightly-1.8/ws/pom.xml>
-Dmaven.repo.local=/home/jenkins/jenkins-slave/maven-repositories/1 -U clean deploy
[INFO] Scanning for projects...
[INFO]                                                                         
[INFO] ------------------------------------------------------------------------
[INFO] Building Apache Sling Scripting HTL Engine 1.0.49-1.3.1-SNAPSHOT
[INFO] ------------------------------------------------------------------------
[INFO] Downloading: http://repository.apache.org/snapshots/org/apache/sling/org.apache.sling.scripting.sightly.compiler/1.0.21-1.3.1-SNAPSHOT/maven-metadata.xml
[INFO] Downloaded: http://repository.apache.org/snapshots/org/apache/sling/org.apache.sling.scripting.sightly.compiler/1.0.21-1.3.1-SNAPSHOT/maven-metadata.xml
(2 KB at 2.2 KB/sec)
[INFO] Downloading: http://repository.apache.org/snapshots/org/apache/sling/org.apache.sling.scripting.sightly.compiler/1.0.21-1.3.1-SNAPSHOT/org.apache.sling.scripting.sightly.compiler-1.0.21-1.3.1-20180222.084400-4.pom
[INFO] Downloaded: http://repository.apache.org/snapshots/org/apache/sling/org.apache.sling.scripting.sightly.compiler/1.0.21-1.3.1-SNAPSHOT/org.apache.sling.scripting.sightly.compiler-1.0.21-1.3.1-20180222.084400-4.pom
(11 KB at 34.7 KB/sec)
[INFO] Downloading: http://repository.apache.org/snapshots/org/apache/sling/org.apache.sling.scripting.sightly.compiler.java/1.0.23-1.3.1-SNAPSHOT/maven-metadata.xml
[INFO] Downloading: http://repository.apache.org/snapshots/org/apache/sling/org.apache.sling.scripting.sightly.compiler.java/1.0.23-1.3.1-SNAPSHOT/org.apache.sling.scripting.sightly.compiler.java-1.0.23-1.3.1-SNAPSHOT.pom
[WARNING] The POM for org.apache.sling:org.apache.sling.scripting.sightly.compiler.java:jar:1.0.23-1.3.1-SNAPSHOT
is missing, no dependency information available
[INFO] Downloading: http://repository.apache.org/snapshots/org/apache/sling/org.apache.sling.scripting.sightly.compiler/1.0.21-1.3.1-SNAPSHOT/org.apache.sling.scripting.sightly.compiler-1.0.21-1.3.1-20180222.084400-4.jar
[INFO] Downloading: http://repository.apache.org/snapshots/org/apache/sling/org.apache.sling.scripting.sightly.compiler.java/1.0.23-1.3.1-SNAPSHOT/org.apache.sling.scripting.sightly.compiler.java-1.0.23-1.3.1-SNAPSHOT.jar
[INFO] Downloaded: http://repository.apache.org/snapshots/org/apache/sling/org.apache.sling.scripting.sightly.compiler/1.0.21-1.3.1-SNAPSHOT/org.apache.sling.scripting.sightly.compiler-1.0.21-1.3.1-20180222.084400-4.jar
(524 KB at 799.7 KB/sec)
[JENKINS] Archiving disabled
[JENKINS] Archiving disabled
[INFO] ------------------------------------------------------------------------
[INFO] BUILD FAILURE
[INFO] ------------------------------------------------------------------------
[INFO] Total time: 13.689 s
[INFO] Finished at: 2018-02-22T22:06:43+00:00
[INFO] Final Memory: 20M/294M
[INFO] ------------------------------------------------------------------------
Waiting for Jenkins to finish collecting data
[ERROR] Failed to execute goal on project org.apache.sling.scripting.sightly: Could not resolve
dependencies for project org.apache.sling:org.apache.sling.scripting.sightly:bundle:1.0.49-1.3.1-SNAPSHOT:
Could not find artifact org.apache.sling:org.apache.sling.scripting.sightly.compiler.java:jar:1.0.23-1.3.1-SNAPSHOT
in Nexus (http://repository.apache.org/snapshots) -> [Help 1]
[ERROR] 
[ERROR] To see the full stack trace of the errors, re-run Maven with the -e switch.
[ERROR] Re-run Maven using the -X switch to enable full debug logging.
[ERROR] 
[ERROR] For more information about the errors and possible solutions, please read the following
articles:
[ERROR] [Help 1] http://cwiki.apache.org/confluence/display/MAVEN/DependencyResolutionException
channel stopped
Recording test results

Mime
View raw message