sling-commits mailing list archives

Site index · List index
Message view « Date » · « Thread »
Top « Date » · « Thread »
From Apache Jenkins Server <jenk...@builds.apache.org>
Subject Build failed in Jenkins: sling-org-apache-sling-launchpad-testing-10 #26
Date Sat, 24 Feb 2018 12:50:15 GMT
See <https://builds.apache.org/job/sling-org-apache-sling-launchpad-testing-10/26/display/redirect>

------------------------------------------
Started by timer
[EnvInject] - Loading node environment variables.
Building remotely on H27 (ubuntu xenial) in workspace <https://builds.apache.org/job/sling-org-apache-sling-launchpad-testing-10/ws/>
 > git rev-parse --is-inside-work-tree # timeout=10
Fetching changes from the remote Git repository
 > git config remote.origin.url https://github.com/apache/sling-org-apache-sling-launchpad-testing.git
# timeout=10
Fetching upstream changes from https://github.com/apache/sling-org-apache-sling-launchpad-testing.git
 > git --version # timeout=10
 > git fetch --tags --progress https://github.com/apache/sling-org-apache-sling-launchpad-testing.git
+refs/heads/*:refs/remotes/origin/*
 > git rev-parse origin/master^{commit} # timeout=10
Checking out Revision 8325d11b2c094ab9fef235abc07e6f1c7c915f50 (origin/master)
 > git config core.sparsecheckout # timeout=10
 > git checkout -f 8325d11b2c094ab9fef235abc07e6f1c7c915f50
Commit message: "SLING-7353 Update to Sling Parent 33"
 > git rev-list --no-walk 8325d11b2c094ab9fef235abc07e6f1c7c915f50 # timeout=10
Parsing POMs
Established TCP socket on 34686
maven33-agent.jar already up to date
maven33-interceptor.jar already up to date
maven3-interceptor-commons.jar already up to date
[sling-org-apache-sling-launchpad-testing-10] $ /home/jenkins/tools/java/jdk-10-ea+36/bin/java
-Xmx2g -Xms256m -cp /home/jenkins/jenkins-slave/maven33-agent.jar:/home/jenkins/tools/maven/apache-maven-3.3.9/boot/plexus-classworlds-2.5.2.jar:/home/jenkins/tools/maven/apache-maven-3.3.9/conf/logging
jenkins.maven3.agent.Maven33Main /home/jenkins/tools/maven/apache-maven-3.3.9 /home/jenkins/jenkins-slave/slave.jar
/home/jenkins/jenkins-slave/maven33-interceptor.jar /home/jenkins/jenkins-slave/maven3-interceptor-commons.jar
34686
<===[JENKINS REMOTING CAPACITY]===>   channel started
WARNING: An illegal reflective access operation has occurred
WARNING: Illegal reflective access by hudson.remoting.RemoteClassLoader (file:/home/jenkins/jenkins-slave/slave.jar)
to method java.lang.ClassLoader.getClassLoadingLock(java.lang.String)
WARNING: Please consider reporting this to the maintainers of hudson.remoting.RemoteClassLoader
WARNING: Use --illegal-access=warn to enable warnings of further illegal reflective access
operations
WARNING: All illegal access operations will be denied in a future release
Executing Maven:  -B -f <https://builds.apache.org/job/sling-org-apache-sling-launchpad-testing-10/ws/pom.xml>
-Dmaven.repo.local=/home/jenkins/jenkins-slave/maven-repositories/0 -U clean verify
[INFO] Scanning for projects...
[INFO] Downloading: http://repository.apache.org/snapshots/org/apache/sling/org.apache.sling.launchpad.test-bundles/0.0.5-SNAPSHOT/maven-metadata.xml
[INFO] Downloaded: http://repository.apache.org/snapshots/org/apache/sling/org.apache.sling.launchpad.test-bundles/0.0.5-SNAPSHOT/maven-metadata.xml
(1019 B at 2.3 KB/sec)
[INFO] Downloading: http://repository.apache.org/snapshots/org/apache/sling/org.apache.sling.launchpad.test-bundles/0.0.5-SNAPSHOT/org.apache.sling.launchpad.test-bundles-0.0.5-20180223.042946-8.txt
[INFO] Downloaded: http://repository.apache.org/snapshots/org/apache/sling/org.apache.sling.launchpad.test-bundles/0.0.5-SNAPSHOT/org.apache.sling.launchpad.test-bundles-0.0.5-20180223.042946-8.txt
(2 KB at 5.0 KB/sec)
[INFO] Downloading: http://repository.apache.org/snapshots/org/apache/sling/org.apache.sling.starter/11-SNAPSHOT/maven-metadata.xml
[INFO] Downloaded: http://repository.apache.org/snapshots/org/apache/sling/org.apache.sling.starter/11-SNAPSHOT/maven-metadata.xml
(2 KB at 4.4 KB/sec)
[INFO] Downloading: http://repository.apache.org/snapshots/org/apache/sling/org.apache.sling.starter/11-SNAPSHOT/org.apache.sling.starter-11-20180224.070127-18-slingfeature.txt
[INFO] Downloaded: http://repository.apache.org/snapshots/org/apache/sling/org.apache.sling.starter/11-SNAPSHOT/org.apache.sling.starter-11-20180224.070127-18-slingfeature.txt
(31 KB at 97.7 KB/sec)
[INFO] Extended Maven classpath (scope 'provided') by the dependencies extracted from the
Sling model.
[INFO]                                                                         
[INFO] ------------------------------------------------------------------------
[INFO] Building Apache Sling Launchpad Testing 11-SNAPSHOT
[INFO] ------------------------------------------------------------------------
[INFO] Downloading: http://repository.apache.org/snapshots/org/apache/sling/org.apache.sling.launchpad.integration-tests/1.0.7-SNAPSHOT/maven-metadata.xml
[INFO] Downloaded: http://repository.apache.org/snapshots/org/apache/sling/org.apache.sling.launchpad.integration-tests/1.0.7-SNAPSHOT/maven-metadata.xml
(2 KB at 3.1 KB/sec)
[INFO] Downloading: http://repository.apache.org/snapshots/org/apache/sling/org.apache.sling.launchpad.integration-tests/1.0.7-SNAPSHOT/org.apache.sling.launchpad.integration-tests-1.0.7-20180223.043614-17.pom
[INFO] Downloaded: http://repository.apache.org/snapshots/org/apache/sling/org.apache.sling.launchpad.integration-tests/1.0.7-SNAPSHOT/org.apache.sling.launchpad.integration-tests-1.0.7-20180223.043614-17.pom
(12 KB at 36.3 KB/sec)
[INFO] Downloading: http://repository.apache.org/snapshots/org/apache/sling/org.apache.sling.junit.teleporter/1.0.17-SNAPSHOT/maven-metadata.xml
[INFO] Downloaded: http://repository.apache.org/snapshots/org/apache/sling/org.apache.sling.junit.teleporter/1.0.17-SNAPSHOT/maven-metadata.xml
(1021 B at 3.1 KB/sec)
[INFO] Downloading: http://repository.apache.org/snapshots/org/apache/sling/org.apache.sling.junit.teleporter/1.0.17-SNAPSHOT/org.apache.sling.junit.teleporter-1.0.17-20180223.042956-16.pom
[INFO] Downloaded: http://repository.apache.org/snapshots/org/apache/sling/org.apache.sling.junit.teleporter/1.0.17-SNAPSHOT/org.apache.sling.junit.teleporter-1.0.17-20180223.042956-16.pom
(6 KB at 17.3 KB/sec)
[INFO] Downloading: http://repository.apache.org/snapshots/org/apache/sling/org.apache.sling.launchpad.test-services/2.0.15-SNAPSHOT/maven-metadata.xml
[INFO] Downloaded: http://repository.apache.org/snapshots/org/apache/sling/org.apache.sling.launchpad.test-services/2.0.15-SNAPSHOT/maven-metadata.xml
(1 KB at 3.3 KB/sec)
[INFO] Downloading: http://repository.apache.org/snapshots/org/apache/sling/org.apache.sling.launchpad.test-bundles/0.0.5-SNAPSHOT/org.apache.sling.launchpad.test-bundles-0.0.5-20180223.042946-8.pom
[INFO] Downloaded: http://repository.apache.org/snapshots/org/apache/sling/org.apache.sling.launchpad.test-bundles/0.0.5-SNAPSHOT/org.apache.sling.launchpad.test-bundles-0.0.5-20180223.042946-8.pom
(3 KB at 7.2 KB/sec)
[INFO] Downloading: http://repository.apache.org/snapshots/org/apache/sling/org.apache.sling.starter/11-SNAPSHOT/org.apache.sling.starter-11-20180224.070127-18.pom
[INFO] Downloaded: http://repository.apache.org/snapshots/org/apache/sling/org.apache.sling.starter/11-SNAPSHOT/org.apache.sling.starter-11-20180224.070127-18.pom
(8 KB at 23.4 KB/sec)
[INFO] Downloading: http://repository.apache.org/snapshots/org/apache/sling/org.apache.sling.launchpad.test-fragment/2.0.15-SNAPSHOT/maven-metadata.xml
[INFO] Downloaded: http://repository.apache.org/snapshots/org/apache/sling/org.apache.sling.launchpad.test-fragment/2.0.15-SNAPSHOT/maven-metadata.xml
(1 KB at 3.1 KB/sec)
[INFO] Downloading: http://repository.apache.org/snapshots/org/apache/sling/org.apache.sling.launchpad.test-fragment/2.0.15-SNAPSHOT/org.apache.sling.launchpad.test-fragment-2.0.15-20180223.043039-7.pom
[INFO] Downloaded: http://repository.apache.org/snapshots/org/apache/sling/org.apache.sling.launchpad.test-fragment/2.0.15-SNAPSHOT/org.apache.sling.launchpad.test-fragment-2.0.15-20180223.043039-7.pom
(3 KB at 8.7 KB/sec)
[INFO] Downloading: http://repository.apache.org/snapshots/org/apache/sling/org.apache.sling.launchpad.test-services-war/2.0.15-SNAPSHOT/maven-metadata.xml
[INFO] Downloaded: http://repository.apache.org/snapshots/org/apache/sling/org.apache.sling.launchpad.test-services-war/2.0.15-SNAPSHOT/maven-metadata.xml
(2 KB at 3.1 KB/sec)
[INFO] Downloading: http://repository.apache.org/snapshots/org/apache/sling/org.apache.sling.launchpad.test-services-war/2.0.15-SNAPSHOT/org.apache.sling.launchpad.test-services-war-2.0.15-20180222.210128-6.pom
[INFO] Downloaded: http://repository.apache.org/snapshots/org/apache/sling/org.apache.sling.launchpad.test-services-war/2.0.15-SNAPSHOT/org.apache.sling.launchpad.test-services-war-2.0.15-20180222.210128-6.pom
(6 KB at 17.5 KB/sec)
[INFO] Downloading: http://repository.apache.org/snapshots/org/apache/sling/org.apache.sling.auth.form/1.0.9-SNAPSHOT/maven-metadata.xml
[INFO] Downloaded: http://repository.apache.org/snapshots/org/apache/sling/org.apache.sling.auth.form/1.0.9-SNAPSHOT/maven-metadata.xml
(1018 B at 3.2 KB/sec)
[INFO] Downloading: http://repository.apache.org/snapshots/org/apache/sling/org.apache.sling.launchpad.content/2.0.13-SNAPSHOT/maven-metadata.xml
[INFO] Downloaded: http://repository.apache.org/snapshots/org/apache/sling/org.apache.sling.launchpad.content/2.0.13-SNAPSHOT/maven-metadata.xml
(1022 B at 3.0 KB/sec)
[INFO] Downloading: http://repository.apache.org/snapshots/org/apache/sling/org.apache.sling.launchpad.integration-tests/1.0.7-SNAPSHOT/org.apache.sling.launchpad.integration-tests-1.0.7-20180223.043614-17.jar
[INFO] Downloading: http://repository.apache.org/snapshots/org/apache/sling/org.apache.sling.junit.teleporter/1.0.17-SNAPSHOT/org.apache.sling.junit.teleporter-1.0.17-20180223.042956-16.jar
[INFO] Downloading: http://repository.apache.org/snapshots/org/apache/sling/org.apache.sling.launchpad.test-fragment/2.0.15-SNAPSHOT/org.apache.sling.launchpad.test-fragment-2.0.15-20180223.043039-7.jar
[INFO] Downloading: http://repository.apache.org/snapshots/org/apache/sling/org.apache.sling.launchpad.test-services-war/2.0.15-SNAPSHOT/org.apache.sling.launchpad.test-services-war-2.0.15-20180222.210128-6.war
[INFO] Downloaded: http://repository.apache.org/snapshots/org/apache/sling/org.apache.sling.launchpad.test-services-war/2.0.15-SNAPSHOT/org.apache.sling.launchpad.test-services-war-2.0.15-20180222.210128-6.war
(14 KB at 43.6 KB/sec)
[INFO] Downloaded: http://repository.apache.org/snapshots/org/apache/sling/org.apache.sling.launchpad.test-fragment/2.0.15-SNAPSHOT/org.apache.sling.launchpad.test-fragment-2.0.15-20180223.043039-7.jar
(9 KB at 27.9 KB/sec)
[INFO] Downloaded: http://repository.apache.org/snapshots/org/apache/sling/org.apache.sling.junit.teleporter/1.0.17-SNAPSHOT/org.apache.sling.junit.teleporter-1.0.17-20180223.042956-16.jar
(37 KB at 94.0 KB/sec)
[INFO] Downloaded: http://repository.apache.org/snapshots/org/apache/sling/org.apache.sling.launchpad.integration-tests/1.0.7-SNAPSHOT/org.apache.sling.launchpad.integration-tests-1.0.7-20180223.043614-17.jar
(485 KB at 710.5 KB/sec)
[INFO] 
[INFO] --- maven-clean-plugin:3.0.0:clean (default-clean) @ org.apache.sling.launchpad.testing
---
[INFO] Deleting <https://builds.apache.org/job/sling-org-apache-sling-launchpad-testing-10/ws/target>
[INFO] 
[INFO] --- maven-enforcer-plugin:3.0.0-M1:enforce (enforce-property-values) @ org.apache.sling.launchpad.testing
---
[INFO] 
[INFO] --- maven-enforcer-plugin:3.0.0-M1:enforce (enforce-java) @ org.apache.sling.launchpad.testing
---
[INFO] 
[INFO] --- maven-enforcer-plugin:3.0.0-M1:enforce (ban-maven-scr-plugin) @ org.apache.sling.launchpad.testing
---
[INFO] 
[INFO] --- maven-remote-resources-plugin:1.5:process (process-resource-bundles) @ org.apache.sling.launchpad.testing
---
[INFO] 
[INFO] --- maven-remote-resources-plugin:1.5:process (default) @ org.apache.sling.launchpad.testing
---
[INFO] 
[INFO] --- maven-resources-plugin:2.7:resources (default-resources) @ org.apache.sling.launchpad.testing
---
[INFO] Using 'UTF-8' encoding to copy filtered resources.
[INFO] skip non existing resourceDirectory <https://builds.apache.org/job/sling-org-apache-sling-launchpad-testing-10/ws/src/main/resources>
[INFO] Copying 3 resources
[INFO] Copying 3 resources
[INFO] 
[INFO] --- build-helper-maven-plugin:3.0.0:reserve-network-port (reserve-network-port) @ org.apache.sling.launchpad.testing
---
[INFO] Port assigned41000
[INFO] Reserved port 41000 for http.port
[INFO] Port assigned41001
[INFO] Reserved port 41001 for sling.control.port
[INFO] 
[INFO] --- maven-compiler-plugin:3.7.0:compile (default-compile) @ org.apache.sling.launchpad.testing
---
[INFO] No sources to compile
[INFO] 
[INFO] --- maven-resources-plugin:2.7:testResources (default-testResources) @ org.apache.sling.launchpad.testing
---
[INFO] Using 'UTF-8' encoding to copy filtered resources.
[INFO] Copying 1 resource
[INFO] Copying 3 resources
[INFO] Copying 3 resources
[INFO] 
[INFO] --- maven-compiler-plugin:3.7.0:testCompile (default-testCompile) @ org.apache.sling.launchpad.testing
---
[INFO] No sources to compile
[INFO] 
[INFO] --- maven-surefire-plugin:2.20.1:test (default-test) @ org.apache.sling.launchpad.testing
---
[JENKINS] Recording test results
[INFO] 
[INFO] --- slingstart-maven-plugin:1.7.16:prepare-package (default-prepare-package) @ org.apache.sling.launchpad.testing
---
[INFO] 
[INFO] --- slingstart-maven-plugin:1.7.16:attach-slingfeature (default-attach-slingfeature)
@ org.apache.sling.launchpad.testing ---
[INFO] 
[INFO] --- slingstart-maven-plugin:1.7.16:package (default-package) @ org.apache.sling.launchpad.testing
---
[INFO] Packaging standalone jar...
[INFO] Building zip: <https://builds.apache.org/job/sling-org-apache-sling-launchpad-testing-10/ws/target/org.apache.sling.launchpad.testing-11-SNAPSHOT.jar>
[INFO] 
[INFO] >>> maven-source-plugin:3.0.1:jar (attach-sources) > generate-sources @
org.apache.sling.launchpad.testing >>>
[INFO] 
[INFO] --- maven-enforcer-plugin:3.0.0-M1:enforce (enforce-property-values) @ org.apache.sling.launchpad.testing
---
[INFO] 
[INFO] --- maven-enforcer-plugin:3.0.0-M1:enforce (enforce-java) @ org.apache.sling.launchpad.testing
---
[INFO] 
[INFO] --- maven-enforcer-plugin:3.0.0-M1:enforce (ban-maven-scr-plugin) @ org.apache.sling.launchpad.testing
---
[WARNING] Failed to getClass for org.apache.maven.plugins.source.SourceJarMojo
[INFO] 
[INFO] <<< maven-source-plugin:3.0.1:jar (attach-sources) < generate-sources @
org.apache.sling.launchpad.testing <<<
[INFO] 
[INFO] --- maven-source-plugin:3.0.1:jar (attach-sources) @ org.apache.sling.launchpad.testing
---
[INFO] Building jar: <https://builds.apache.org/job/sling-org-apache-sling-launchpad-testing-10/ws/target/org.apache.sling.launchpad.testing-11-SNAPSHOT-sources.jar>
[INFO] 
[INFO] --- maven-site-plugin:3.5.1:attach-descriptor (attach-descriptor) @ org.apache.sling.launchpad.testing
---
[INFO] 
[INFO] --- slingstart-maven-plugin:1.7.16:start (start-container) @ org.apache.sling.launchpad.testing
---
[INFO] Using launchpad jar being generated as this project's primary artifact: '<https://builds.apache.org/job/sling-org-apache-sling-launchpad-testing-10/ws/target/org.apache.sling.launchpad.testing-11-SNAPSHOT.jar'!>
[INFO] Starting Launchpad _-41000...
-------------------------------------------------------------------
Slingstart application: <https://builds.apache.org/job/sling-org-apache-sling-launchpad-testing-10/ws/target/_-41000/org.apache.sling.launchpad.testing-11-SNAPSHOT.jar>
Main class: org.apache.sling.launchpad.app.Main
Listener Port: 40924
Arguments: [-p, 41000, -j, 41001]
-------------------------------------------------------------------
24.02.2018 12:49:08.419 *INFO * [main] Setting sling.home=sling (default)
24.02.2018 12:49:08.422 *INFO * [main] Starting Apache Sling in <https://builds.apache.org/job/sling-org-apache-sling-launchpad-testing-10/ws/target/_-41000/sling>
24.02.2018 12:49:08.426 *INFO * [main] Sling  Extension Lib Home : <https://builds.apache.org/job/sling-org-apache-sling-launchpad-testing-10/ws/target/_-41000/sling/ext>
24.02.2018 12:49:08.426 *INFO * [main] Checking launcher JAR in folder <https://builds.apache.org/job/sling-org-apache-sling-launchpad-testing-10/ws/target/_-41000/sling>
24.02.2018 12:49:08.442 *INFO * [main] Installing new launcher: jar:<https://builds.apache.org/job/sling-org-apache-sling-launchpad-testing-10/ws/target/_-41000/org.apache.sling.launchpad.testing-11-SNAPSHOT.jar!/resources/org.apache.sling.launchpad.base.jar,>
5.6.10.2_6_26 (org.apache.sling.launchpad.base.jar.1519476548442)
24.02.2018 12:49:08.443 *INFO * [main] Loading launcher class org.apache.sling.launchpad.base.app.MainDelegate
from org.apache.sling.launchpad.base.jar.1519476548442
24.02.2018 12:49:08.444 *INFO * [main] External Libs Home (ext) is null or does not exists.
24.02.2018 12:49:08.456 *INFO * [main] Setting sling.launchpad=<https://builds.apache.org/job/sling-org-apache-sling-launchpad-testing-10/ws/target/_-41000/sling>
24.02.2018 12:49:08.456 *INFO * [main] Setting org.osgi.service.http.port=41000
24.02.2018 12:49:08.456 *INFO * [main] Setting sling.control.socket=41001
24.02.2018 12:49:08.456 *INFO * [main] Starting launcher ...
24.02.2018 12:49:08.467 *INFO * [main] HTTP server port: 41000
WARNING: An illegal reflective access operation has occurred
WARNING: Illegal reflective access by org.apache.felix.framework.ext.ClassPathExtenderFactory$DefaultClassLoaderExtender
(<https://builds.apache.org/job/sling-org-apache-sling-launchpad-testing-10/ws/target/_-41000/sling/org.apache.sling.launchpad.base.jar.1519476548442)>
to method java.net.URLClassLoader.addURL(java.net.URL)
WARNING: Please consider reporting this to the maintainers of org.apache.felix.framework.ext.ClassPathExtenderFactory$DefaultClassLoaderExtender
WARNING: Use --illegal-access=warn to enable warnings of further illegal reflective access
operations
WARNING: All illegal access operations will be denied in a future release
24.02.2018 12:49:09.708 *INFO * [main] Startup completed
24.02.2018 12:49:09.996 *INFO* [OsgiInstallerImpl] org.apache.sling.audit.osgi.installer Installed
configuration org.apache.sling.engine.impl.log.RequestLogger from resource TaskResource(url=launchpad:resources/config/org.apache.sling.engine.impl.log.RequestLogger.config,
entity=config:org.apache.sling.engine.impl.log.RequestLogger, state=INSTALL, attributes=[org.apache.sling.installer.api.tasks.ResourceTransformer=:19:,
service.pid=org.apache.sling.engine.impl.log.RequestLogger], digest=a475207c9e345f2a0e987500d3df7fc4)
24.02.2018 12:49:09.997 *INFO* [OsgiInstallerImpl] org.apache.sling.audit.osgi.installer Installed
configuration org.apache.sling.jcr.base.internal.LoginAdminWhitelist from resource TaskResource(url=launchpad:resources/config/org.apache.sling.jcr.base.internal.LoginAdminWhitelist.config,
entity=config:org.apache.sling.jcr.base.internal.LoginAdminWhitelist, state=INSTALL, attributes=[org.apache.sling.installer.api.tasks.ResourceTransformer=:19:,
service.pid=org.apache.sling.jcr.base.internal.LoginAdminWhitelist], digest=251b8528cdb27078e3831df85db59aea)
24.02.2018 12:49:09.999 *INFO* [OsgiInstallerImpl] org.apache.sling.audit.osgi.installer Installed
configuration org.apache.sling.jcr.base.internal.LoginAdminWhitelist.fragment.699a1dcc-8d75-4994-9a96-b5b87aca0fa8
from resource TaskResource(url=launchpad:resources/config/org.apache.sling.jcr.base.internal.LoginAdminWhitelist.fragment-sling.config,
entity=config:org.apache.sling.jcr.base.internal.LoginAdminWhitelist.fragment.sling, state=INSTALL,
attributes=[org.apache.sling.installer.api.tasks.ResourceTransformer=:19:, service.factoryPid=org.apache.sling.jcr.base.internal.LoginAdminWhitelist.fragment,
service.pid=sling], digest=b57bfd8d9f92019f6166ea7005255d38)
24.02.2018 12:49:10.001 *INFO* [OsgiInstallerImpl] org.apache.sling.audit.osgi.installer Installed
configuration org.apache.sling.jcr.davex.impl.servlets.SlingDavExServlet from resource TaskResource(url=launchpad:resources/config/org.apache.sling.jcr.davex.impl.servlets.SlingDavExServlet.config,
entity=config:org.apache.sling.jcr.davex.impl.servlets.SlingDavExServlet, state=INSTALL, attributes=[org.apache.sling.installer.api.tasks.ResourceTransformer=:19:,
service.pid=org.apache.sling.jcr.davex.impl.servlets.SlingDavExServlet], digest=ee3357fb8cc76c8d77dfa8b61bc29ef3)
24.02.2018 12:49:10.002 *INFO* [OsgiInstallerImpl] org.apache.sling.audit.osgi.installer Installed
configuration org.apache.sling.jcr.repoinit.impl.RepositoryInitializer from resource TaskResource(url=launchpad:resources/config/org.apache.sling.jcr.repoinit.impl.RepositoryInitializer.config,
entity=config:org.apache.sling.jcr.repoinit.impl.RepositoryInitializer, state=INSTALL, attributes=[org.apache.sling.installer.api.tasks.ResourceTransformer=:19:,
service.pid=org.apache.sling.jcr.repoinit.impl.RepositoryInitializer], digest=62590adee787f806d60b246345ae4991)
24.02.2018 12:49:10.004 *INFO* [OsgiInstallerImpl] org.apache.sling.audit.osgi.installer Installed
configuration org.apache.sling.jcr.webdav.impl.servlets.SimpleWebDavServlet from resource
TaskResource(url=launchpad:resources/config/org.apache.sling.jcr.webdav.impl.servlets.SimpleWebDavServlet.config,
entity=config:org.apache.sling.jcr.webdav.impl.servlets.SimpleWebDavServlet, state=INSTALL,
attributes=[org.apache.sling.installer.api.tasks.ResourceTransformer=:19:, service.pid=org.apache.sling.jcr.webdav.impl.servlets.SimpleWebDavServlet],
digest=40b06a2412e7e842f149163de5a9ae75)
24.02.2018 12:49:10.005 *INFO* [OsgiInstallerImpl] org.apache.sling.audit.osgi.installer Installed
configuration org.apache.sling.scripting.core.impl.ScriptCacheImpl from resource TaskResource(url=launchpad:resources/config/org.apache.sling.scripting.core.impl.ScriptCacheImpl.config,
entity=config:org.apache.sling.scripting.core.impl.ScriptCacheImpl, state=INSTALL, attributes=[org.apache.sling.installer.api.tasks.ResourceTransformer=:19:,
service.pid=org.apache.sling.scripting.core.impl.ScriptCacheImpl], digest=13b57519a048a6c8873ed61949d013f6)
24.02.2018 12:49:10.011 *INFO* [OsgiInstallerImpl] org.apache.sling.audit.osgi.installer Installed
configuration org.apache.sling.serviceusermapping.impl.ServiceUserMapperImpl.amended.56554b5d-25c7-408c-9582-e9a0a1b0fb47
from resource TaskResource(url=launchpad:resources/config/org.apache.sling.serviceusermapping.impl.ServiceUserMapperImpl.amended-jcr-install.config,
entity=config:org.apache.sling.serviceusermapping.impl.ServiceUserMapperImpl.amended.jcr-install,
state=INSTALL, attributes=[org.apache.sling.installer.api.tasks.ResourceTransformer=:19:,
service.factoryPid=org.apache.sling.serviceusermapping.impl.ServiceUserMapperImpl.amended,
service.pid=jcr-install], digest=c54b829f7b7740a799d99e251af020c9)
24.02.2018 12:49:10.013 *INFO* [OsgiInstallerImpl] org.apache.sling.audit.osgi.installer Installed
configuration org.apache.sling.serviceusermapping.impl.ServiceUserMapperImpl.amended.8dcf1368-3bed-44c4-802d-cae284771cf5
from resource TaskResource(url=launchpad:resources/config/org.apache.sling.serviceusermapping.impl.ServiceUserMapperImpl.amended-jcr-resource.config,
entity=config:org.apache.sling.serviceusermapping.impl.ServiceUserMapperImpl.amended.jcr-resource,
state=INSTALL, attributes=[org.apache.sling.installer.api.tasks.ResourceTransformer=:19:,
service.factoryPid=org.apache.sling.serviceusermapping.impl.ServiceUserMapperImpl.amended,
service.pid=jcr-resource], digest=8b9c2b1535ffb961711fa342f873d589)
24.02.2018 12:49:10.014 *INFO* [OsgiInstallerImpl] org.apache.sling.audit.osgi.installer Installed
configuration org.apache.sling.serviceusermapping.impl.ServiceUserMapperImpl.amended.397064ed-2a5b-4d17-9168-8667ec8f4975
from resource TaskResource(url=launchpad:resources/config/org.apache.sling.serviceusermapping.impl.ServiceUserMapperImpl.amended-observation.config,
entity=config:org.apache.sling.serviceusermapping.impl.ServiceUserMapperImpl.amended.observation,
state=INSTALL, attributes=[org.apache.sling.installer.api.tasks.ResourceTransformer=:19:,
service.factoryPid=org.apache.sling.serviceusermapping.impl.ServiceUserMapperImpl.amended,
service.pid=observation], digest=b358fca04fc5775b5fee0983520f157b)
24.02.2018 12:49:10.016 *INFO* [OsgiInstallerImpl] org.apache.sling.audit.osgi.installer Installed
configuration org.apache.sling.serviceusermapping.impl.ServiceUserMapperImpl.amended.e0f484cd-0692-4b74-817d-dd918eb5654c
from resource TaskResource(url=launchpad:resources/config/org.apache.sling.serviceusermapping.impl.ServiceUserMapperImpl.amended-resourceresolver.config,
entity=config:org.apache.sling.serviceusermapping.impl.ServiceUserMapperImpl.amended.resourceresolver,
state=INSTALL, attributes=[org.apache.sling.installer.api.tasks.ResourceTransformer=:19:,
service.factoryPid=org.apache.sling.serviceusermapping.impl.ServiceUserMapperImpl.amended,
service.pid=resourceresolver], digest=d317bcbc20315e21bdbb0480199d7a55)
24.02.2018 12:49:10.017 *INFO* [OsgiInstallerImpl] org.apache.sling.audit.osgi.installer Installed
configuration org.apache.sling.serviceusermapping.impl.ServiceUserMapperImpl.amended.bc20abff-ced0-43fa-af5c-55d47a0cf452
from resource TaskResource(url=launchpad:resources/config/org.apache.sling.serviceusermapping.impl.ServiceUserMapperImpl.amended-scripting.config,
entity=config:org.apache.sling.serviceusermapping.impl.ServiceUserMapperImpl.amended.scripting,
state=INSTALL, attributes=[org.apache.sling.installer.api.tasks.ResourceTransformer=:19:,
service.factoryPid=org.apache.sling.serviceusermapping.impl.ServiceUserMapperImpl.amended,
service.pid=scripting], digest=479bf62d1c800aa03dba13706319afd1)
24.02.2018 12:49:10.019 *INFO* [OsgiInstallerImpl] org.apache.sling.audit.osgi.installer Installed
configuration org.apache.sling.serviceusermapping.impl.ServiceUserMapperImpl.amended.ce8199d5-d5ac-4c4f-8718-5518fa1d4759
from resource TaskResource(url=launchpad:resources/config/org.apache.sling.serviceusermapping.impl.ServiceUserMapperImpl.amended-servletsresolver.config,
entity=config:org.apache.sling.serviceusermapping.impl.ServiceUserMapperImpl.amended.servletsresolver,
state=INSTALL, attributes=[org.apache.sling.installer.api.tasks.ResourceTransformer=:19:,
service.factoryPid=org.apache.sling.serviceusermapping.impl.ServiceUserMapperImpl.amended,
service.pid=servletsresolver], digest=36b119a784d011be61d06b5de31d4753)
Feb 24, 2018 12:49:12 PM org.apache.tika.config.InitializableProblemHandler$3 handleInitializableProblem
WARNING: JBIG2ImageReader not loaded. jbig2 files will be ignored
See https://pdfbox.apache.org/2.0/dependencies.html#jai-image-io
for optional dependencies.
TIFFImageWriter not loaded. tiff files will not be processed
See https://pdfbox.apache.org/2.0/dependencies.html#jai-image-io
for optional dependencies.
J2KImageReader not loaded. JPEG2000 files will not be processed.
See https://pdfbox.apache.org/2.0/dependencies.html#jai-image-io
for optional dependencies.

Feb 24, 2018 12:49:12 PM org.apache.tika.config.InitializableProblemHandler$3 handleInitializableProblem
WARNING: org.xerial's sqlite-jdbc is not loaded.
Please provide the jar on your classpath to parse sqlite files.
See tika-parsers/pom.xml for the correct version.
[INFO] Started Launchpad '_-41000' at port 41000 [run modes: null]
[INFO] 
[INFO] --- maven-failsafe-plugin:2.20.1:integration-test (default) @ org.apache.sling.launchpad.testing
---
[JENKINS] Recording test results
[JENKINS] Archiving disabled
Attempting to load ESAPI.properties via file I/O.
Attempting to load ESAPI.properties as resource file via file I/O.
Not found in 'org.owasp.esapi.resources' directory or file not readable: <https://builds.apache.org/job/sling-org-apache-sling-launchpad-testing-10/ws/target/_-41000/ESAPI.properties>
Not found in SystemResource Directory/resourceDirectory: .esapi/ESAPI.properties
Not found in 'user.home' (/home/jenkins) directory: /home/jenkins/esapi/ESAPI.properties
Loading ESAPI.properties via file I/O failed. Exception was: java.io.FileNotFoundException
Attempting to load ESAPI.properties via the classpath.
SUCCESSFULLY LOADED ESAPI.properties via the CLASSPATH from '/ (root)' using class loader
for DefaultSecurityConfiguration class!
Attempting to load validation.properties via file I/O.
Attempting to load validation.properties as resource file via file I/O.
Not found in 'org.owasp.esapi.resources' directory or file not readable: <https://builds.apache.org/job/sling-org-apache-sling-launchpad-testing-10/ws/target/_-41000/validation.properties>
Not found in SystemResource Directory/resourceDirectory: .esapi/validation.properties
Not found in 'user.home' (/home/jenkins) directory: /home/jenkins/esapi/validation.properties
Loading validation.properties via file I/O failed.
Attempting to load validation.properties via the classpath.
SUCCESSFULLY LOADED validation.properties via the CLASSPATH from '/ (root)' using class loader
for DefaultSecurityConfiguration class!
[JENKINS] Archiving disabled
[INFO] ------------------------------------------------------------------------
[INFO] BUILD FAILURE
[INFO] ------------------------------------------------------------------------
[INFO] Total time: 46.974 s
[INFO] Finished at: 2018-02-24T12:49:19+00:00
[INFO] Final Memory: 41M/256M
[INFO] ------------------------------------------------------------------------
Waiting for Jenkins to finish collecting data
[ERROR] Failed to execute goal org.apache.maven.plugins:maven-failsafe-plugin:2.20.1:integration-test
(default) on project org.apache.sling.launchpad.testing: Execution default of goal org.apache.maven.plugins:maven-failsafe-plugin:2.20.1:integration-test
failed. NullPointerException -> [Help 1]
[ERROR] 
[ERROR] To see the full stack trace of the errors, re-run Maven with the -e switch.
[ERROR] Re-run Maven using the -X switch to enable full debug logging.
[ERROR] 
[ERROR] For more information about the errors and possible solutions, please read the following
articles:
[ERROR] [Help 1] http://cwiki.apache.org/confluence/display/MAVEN/PluginExecutionException
channel stopped
Terminating launchpad _-41000
24.02.2018 12:50:09.901 *INFO * [Apache Sling Terminator] Java VM is shutting down
24.02.2018 12:50:09.903 *INFO * [Apache Sling Terminator] Stopping Apache Sling
Archiving artifacts
24.02.2018 12:50:11.094 *INFO * [Sling Notifier] Apache Sling has been stopped
Recording test results

Mime
View raw message