sling-commits mailing list archives

Site index · List index
Message view « Date » · « Thread »
Top « Date » · « Thread »
From Apache Jenkins Server <jenk...@builds.apache.org>
Subject Build failed in Jenkins: sling-org-apache-sling-testing-sling-mock-1.8 #24
Date Mon, 26 Feb 2018 11:11:12 GMT
See <https://builds.apache.org/job/sling-org-apache-sling-testing-sling-mock-1.8/24/display/redirect?page=changes>

Changes:

[sseifert] update dependency

[sseifert] [maven-release-plugin] prepare release

[sseifert] [maven-release-plugin] prepare for next development iteration

------------------------------------------
Started by an SCM change
[EnvInject] - Loading node environment variables.
Building remotely on H23 (ubuntu xenial) in workspace <https://builds.apache.org/job/sling-org-apache-sling-testing-sling-mock-1.8/ws/>
 > git rev-parse --is-inside-work-tree # timeout=10
Fetching changes from the remote Git repository
 > git config remote.origin.url https://github.com/apache/sling-org-apache-sling-testing-sling-mock.git
# timeout=10
Fetching upstream changes from https://github.com/apache/sling-org-apache-sling-testing-sling-mock.git
 > git --version # timeout=10
 > git fetch --tags --progress https://github.com/apache/sling-org-apache-sling-testing-sling-mock.git
+refs/heads/*:refs/remotes/origin/*
 > git rev-parse origin/master^{commit} # timeout=10
Checking out Revision c460cf762bb5af47e6317ed74e89db61562415a8 (origin/master)
 > git config core.sparsecheckout # timeout=10
 > git checkout -f c460cf762bb5af47e6317ed74e89db61562415a8
Commit message: "[maven-release-plugin] prepare for next development iteration"
 > git rev-list --no-walk c88437db4f164459f9718b5b5c2b22f5600f5f08 # timeout=10
Parsing POMs
Modules changed, recalculating dependency graph
Established TCP socket on 33009
maven33-agent.jar already up to date
maven33-interceptor.jar already up to date
maven3-interceptor-commons.jar already up to date
[sling-org-apache-sling-testing-sling-mock-1.8] $ /home/jenkins/tools/java/latest1.8/bin/java
-Xmx2g -Xms256m -cp /home/jenkins/jenkins-slave/maven33-agent.jar:/home/jenkins/tools/maven/apache-maven-3.3.9/boot/plexus-classworlds-2.5.2.jar:/home/jenkins/tools/maven/apache-maven-3.3.9/conf/logging
jenkins.maven3.agent.Maven33Main /home/jenkins/tools/maven/apache-maven-3.3.9 /home/jenkins/jenkins-slave/slave.jar
/home/jenkins/jenkins-slave/maven33-interceptor.jar /home/jenkins/jenkins-slave/maven3-interceptor-commons.jar
33009
<===[JENKINS REMOTING CAPACITY]===>   channel started
Executing Maven:  -B -f <https://builds.apache.org/job/sling-org-apache-sling-testing-sling-mock-1.8/ws/pom.xml>
-Dmaven.repo.local=/home/jenkins/jenkins-slave/maven-repositories/0 -U clean deploy
[INFO] Scanning for projects...
[INFO]                                                                         
[INFO] ------------------------------------------------------------------------
[INFO] Building Apache Sling Testing Sling Mock 2.2.19-SNAPSHOT
[INFO] ------------------------------------------------------------------------
[INFO] Downloading: https://repo.maven.apache.org/maven2/org/apache/sling/org.apache.sling.servlet-helpers/1.1.4/org.apache.sling.servlet-helpers-1.1.4.pom
[WARNING] The POM for org.apache.sling:org.apache.sling.servlet-helpers:jar:1.1.4 is missing,
no dependency information available
[INFO] Downloading: https://repo.maven.apache.org/maven2/org/apache/sling/org.apache.sling.servlet-helpers/1.1.4/org.apache.sling.servlet-helpers-1.1.4.jar
[JENKINS] Archiving disabled
[JENKINS] Archiving disabled
[INFO] ------------------------------------------------------------------------
[INFO] BUILD FAILURE
[INFO] ------------------------------------------------------------------------
[INFO] Total time: 9.576 s
[INFO] Finished at: 2018-02-26T11:11:09+00:00
[INFO] Final Memory: 22M/297M
[INFO] ------------------------------------------------------------------------
Waiting for Jenkins to finish collecting data
[ERROR] Failed to execute goal on project org.apache.sling.testing.sling-mock: Could not resolve
dependencies for project org.apache.sling:org.apache.sling.testing.sling-mock:bundle:2.2.19-SNAPSHOT:
Could not find artifact org.apache.sling:org.apache.sling.servlet-helpers:jar:1.1.4 in central
(https://repo.maven.apache.org/maven2) -> [Help 1]
[ERROR] 
[ERROR] To see the full stack trace of the errors, re-run Maven with the -e switch.
[ERROR] Re-run Maven using the -X switch to enable full debug logging.
[ERROR] 
[ERROR] For more information about the errors and possible solutions, please read the following
articles:
[ERROR] [Help 1] http://cwiki.apache.org/confluence/display/MAVEN/DependencyResolutionException
channel stopped
Recording test results
ERROR: Step ?Publish JUnit test result report? failed: Test reports were found but none of
them are new. Did leafNodes run? 
For example, <https://builds.apache.org/job/sling-org-apache-sling-testing-sling-mock-1.8/ws/target/surefire-reports/TEST-org.apache.sling.testing.mock.sling.MockJcrSlingRepositoryTest.xml>
is 3 days 1 hr old



Mime
View raw message