sling-commits mailing list archives

Site index · List index
Message view « Date » · « Thread »
Top « Date » · « Thread »
From Apache Jenkins Server <jenk...@builds.apache.org>
Subject Build failed in Jenkins: sling-org-apache-sling-serviceuser-webconsole-1.8 #1
Date Tue, 16 Jan 2018 13:05:38 GMT
See <https://builds.apache.org/job/sling-org-apache-sling-serviceuser-webconsole-1.8/1/display/redirect>

------------------------------------------
Started by an SCM change
[EnvInject] - Loading node environment variables.
Building remotely on H31 (ubuntu xenial) in workspace <https://builds.apache.org/job/sling-org-apache-sling-serviceuser-webconsole-1.8/ws/>
Cloning the remote Git repository
Cloning repository https://github.com/apache/sling-org-apache-sling-serviceuser-webconsole.git
 > git init <https://builds.apache.org/job/sling-org-apache-sling-serviceuser-webconsole-1.8/ws/>
# timeout=10
Fetching upstream changes from https://github.com/apache/sling-org-apache-sling-serviceuser-webconsole.git
 > git --version # timeout=10
 > git fetch --tags --progress https://github.com/apache/sling-org-apache-sling-serviceuser-webconsole.git
+refs/heads/*:refs/remotes/origin/*
 > git config remote.origin.url https://github.com/apache/sling-org-apache-sling-serviceuser-webconsole.git
# timeout=10
 > git config --add remote.origin.fetch +refs/heads/*:refs/remotes/origin/* # timeout=10
 > git config remote.origin.url https://github.com/apache/sling-org-apache-sling-serviceuser-webconsole.git
# timeout=10
Fetching upstream changes from https://github.com/apache/sling-org-apache-sling-serviceuser-webconsole.git
 > git fetch --tags --progress https://github.com/apache/sling-org-apache-sling-serviceuser-webconsole.git
+refs/heads/*:refs/remotes/origin/*
 > git rev-parse origin/master^{commit} # timeout=10
Checking out Revision c2c5e9bb67d180a39e421bdf7b8a4dae205ff541 (origin/master)
 > git config core.sparsecheckout # timeout=10
 > git checkout -f c2c5e9bb67d180a39e421bdf7b8a4dae205ff541
Commit message: "[maven-release-plugin] prepare for next development iteration"
First time build. Skipping changelog.
Parsing POMs
Discovered a new module org.apache.sling:org.apache.sling.serviceuser.webconsole Apache Sling
Service User Web Console
Modules changed, recalculating dependency graph
Established TCP socket on 42150
maven33-agent.jar already up to date
maven33-interceptor.jar already up to date
maven3-interceptor-commons.jar already up to date
[sling-org-apache-sling-serviceuser-webconsole-1.8] $ /home/jenkins/tools/java/latest1.8/bin/java
-Xmx2g -Xms256m -cp /home/jenkins/jenkins-slave/maven33-agent.jar:/home/jenkins/tools/maven/apache-maven-3.3.9/boot/plexus-classworlds-2.5.2.jar:/home/jenkins/tools/maven/apache-maven-3.3.9/conf/logging
jenkins.maven3.agent.Maven33Main /home/jenkins/tools/maven/apache-maven-3.3.9 /home/jenkins/jenkins-slave/slave.jar
/home/jenkins/jenkins-slave/maven33-interceptor.jar /home/jenkins/jenkins-slave/maven3-interceptor-commons.jar
42150
<===[JENKINS REMOTING CAPACITY]===>   channel started
Executing Maven:  -B -f <https://builds.apache.org/job/sling-org-apache-sling-serviceuser-webconsole-1.8/ws/pom.xml>
-Dmaven.repo.local=/home/jenkins/jenkins-slave/maven-repositories/0 -U clean deploy
[INFO] Scanning for projects...
[INFO]                                                                         
[INFO] ------------------------------------------------------------------------
[INFO] Building Apache Sling Service User Web Console 1.0.1-SNAPSHOT
[INFO] ------------------------------------------------------------------------
[INFO] Downloading: https://repo.maven.apache.org/maven2/org/apache/sling/org.apache.sling.serviceusermapper/1.4.0/org.apache.sling.serviceusermapper-1.4.0.pom
[WARNING] The POM for org.apache.sling:org.apache.sling.serviceusermapper:jar:1.4.0 is missing,
no dependency information available
[INFO] Downloading: https://repo.maven.apache.org/maven2/org/apache/jackrabbit/jackrabbit-api/2.10.6/jackrabbit-api-2.10.6.pom
[INFO] Downloaded: https://repo.maven.apache.org/maven2/org/apache/jackrabbit/jackrabbit-api/2.10.6/jackrabbit-api-2.10.6.pom
(4 KB at 78.1 KB/sec)
[INFO] Downloading: https://repo.maven.apache.org/maven2/org/apache/jackrabbit/jackrabbit-parent/2.10.6/jackrabbit-parent-2.10.6.pom
[INFO] Downloaded: https://repo.maven.apache.org/maven2/org/apache/jackrabbit/jackrabbit-parent/2.10.6/jackrabbit-parent-2.10.6.pom
(31 KB at 981.1 KB/sec)
[INFO] Downloading: https://repo.maven.apache.org/maven2/org/apache/sling/org.apache.sling.xss/1.0.0/org.apache.sling.xss-1.0.0.pom
[INFO] Downloaded: https://repo.maven.apache.org/maven2/org/apache/sling/org.apache.sling.xss/1.0.0/org.apache.sling.xss-1.0.0.pom
(13 KB at 129.7 KB/sec)
[INFO] Downloading: https://repo.maven.apache.org/maven2/org/apache/sling/org.apache.sling.serviceusermapper/1.4.0/org.apache.sling.serviceusermapper-1.4.0.jar
[INFO] Downloading: https://repo.maven.apache.org/maven2/org/apache/jackrabbit/jackrabbit-api/2.10.6/jackrabbit-api-2.10.6.jar
[INFO] Downloading: https://repo.maven.apache.org/maven2/org/apache/jackrabbit/jackrabbit-jcr-commons/2.0.0/jackrabbit-jcr-commons-2.0.0.jar
[INFO] Downloading: https://repo.maven.apache.org/maven2/org/apache/felix/org.apache.felix.webconsole/4.2.0/org.apache.felix.webconsole-4.2.0.jar
[INFO] Downloading: https://repo.maven.apache.org/maven2/org/apache/sling/org.apache.sling.xss/1.0.0/org.apache.sling.xss-1.0.0.jar
[INFO] Downloaded: https://repo.maven.apache.org/maven2/org/apache/jackrabbit/jackrabbit-jcr-commons/2.0.0/jackrabbit-jcr-commons-2.0.0.jar
(227 KB at 2908.8 KB/sec)
[INFO] Downloaded: https://repo.maven.apache.org/maven2/org/apache/jackrabbit/jackrabbit-api/2.10.6/jackrabbit-api-2.10.6.jar
(40 KB at 387.7 KB/sec)
[INFO] Downloaded: https://repo.maven.apache.org/maven2/org/apache/felix/org.apache.felix.webconsole/4.2.0/org.apache.felix.webconsole-4.2.0.jar
(434 KB at 2465.2 KB/sec)
[INFO] Downloaded: https://repo.maven.apache.org/maven2/org/apache/sling/org.apache.sling.xss/1.0.0/org.apache.sling.xss-1.0.0.jar
(2668 KB at 3844.1 KB/sec)
[JENKINS] Archiving disabled
[JENKINS] Archiving disabled
[INFO] ------------------------------------------------------------------------
[INFO] BUILD FAILURE
[INFO] ------------------------------------------------------------------------
[INFO] Total time: 12.589 s
[INFO] Finished at: 2018-01-16T13:05:36+00:00
[INFO] Final Memory: 20M/302M
[INFO] ------------------------------------------------------------------------
Waiting for Jenkins to finish collecting data
[ERROR] Failed to execute goal on project org.apache.sling.serviceuser.webconsole: Could not
resolve dependencies for project org.apache.sling:org.apache.sling.serviceuser.webconsole:bundle:1.0.1-SNAPSHOT:
Could not find artifact org.apache.sling:org.apache.sling.serviceusermapper:jar:1.4.0 in central
(https://repo.maven.apache.org/maven2) -> [Help 1]
[ERROR] 
[ERROR] To see the full stack trace of the errors, re-run Maven with the -e switch.
[ERROR] Re-run Maven using the -X switch to enable full debug logging.
[ERROR] 
[ERROR] For more information about the errors and possible solutions, please read the following
articles:
[ERROR] [Help 1] http://cwiki.apache.org/confluence/display/MAVEN/DependencyResolutionException
channel stopped
Recording test results

Mime
View raw message