sling-commits mailing list archives

Site index · List index
Message view « Date » · « Thread »
Top « Date » · « Thread »
From Apache Jenkins Server <jenk...@builds.apache.org>
Subject Build failed in Jenkins: sling-org-apache-sling-scripting-sightly-compiler-java-1.8 #27
Date Thu, 25 Jan 2018 07:41:30 GMT
See <https://builds.apache.org/job/sling-org-apache-sling-scripting-sightly-compiler-java-1.8/27/display/redirect?page=changes>

Changes:

[radu] [maven-release-plugin] prepare release

[radu] [maven-release-plugin] prepare for next development iteration

------------------------------------------
Started by an SCM change
[EnvInject] - Loading node environment variables.
Building remotely on ubuntu-6 (ubuntu trusty) in workspace <https://builds.apache.org/job/sling-org-apache-sling-scripting-sightly-compiler-java-1.8/ws/>
Cloning the remote Git repository
Cloning repository https://github.com/apache/sling-org-apache-sling-scripting-sightly-compiler-java.git
 > git init <https://builds.apache.org/job/sling-org-apache-sling-scripting-sightly-compiler-java-1.8/ws/>
# timeout=10
Fetching upstream changes from https://github.com/apache/sling-org-apache-sling-scripting-sightly-compiler-java.git
 > git --version # timeout=10
 > git fetch --tags --progress https://github.com/apache/sling-org-apache-sling-scripting-sightly-compiler-java.git
+refs/heads/*:refs/remotes/origin/*
 > git config remote.origin.url https://github.com/apache/sling-org-apache-sling-scripting-sightly-compiler-java.git
# timeout=10
 > git config --add remote.origin.fetch +refs/heads/*:refs/remotes/origin/* # timeout=10
 > git config remote.origin.url https://github.com/apache/sling-org-apache-sling-scripting-sightly-compiler-java.git
# timeout=10
Fetching upstream changes from https://github.com/apache/sling-org-apache-sling-scripting-sightly-compiler-java.git
 > git fetch --tags --progress https://github.com/apache/sling-org-apache-sling-scripting-sightly-compiler-java.git
+refs/heads/*:refs/remotes/origin/*
 > git rev-parse origin/master^{commit} # timeout=10
Checking out Revision 878cc31251f0d888a021f941ef56148460411b68 (origin/master)
 > git config core.sparsecheckout # timeout=10
 > git checkout -f 878cc31251f0d888a021f941ef56148460411b68
Commit message: "[maven-release-plugin] prepare for next development iteration"
 > git rev-list bdbbc2ab7424e8fd231bb9ba141df4bbac621ded # timeout=10
Parsing POMs
Modules changed, recalculating dependency graph
Established TCP socket on 47814
maven33-agent.jar already up to date
maven33-interceptor.jar already up to date
maven3-interceptor-commons.jar already up to date
[sling-org-apache-sling-scripting-sightly-compiler-java-1.8] $ /home/jenkins/tools/java/latest1.8/bin/java
-Xmx2g -Xms256m -cp /home/jenkins/jenkins-slave/maven33-agent.jar:/home/jenkins/tools/maven/apache-maven-3.3.9/boot/plexus-classworlds-2.5.2.jar:/home/jenkins/tools/maven/apache-maven-3.3.9/conf/logging
jenkins.maven3.agent.Maven33Main /home/jenkins/tools/maven/apache-maven-3.3.9 /home/jenkins/jenkins-slave/slave.jar
/home/jenkins/jenkins-slave/maven33-interceptor.jar /home/jenkins/jenkins-slave/maven3-interceptor-commons.jar
47814
<===[JENKINS REMOTING CAPACITY]===>   channel started
Executing Maven:  -B -f <https://builds.apache.org/job/sling-org-apache-sling-scripting-sightly-compiler-java-1.8/ws/pom.xml>
-Dmaven.repo.local=/home/jenkins/jenkins-slave/maven-repositories/1 -U clean deploy
[INFO] Scanning for projects...
[INFO]                                                                         
[INFO] ------------------------------------------------------------------------
[INFO] Building Apache Sling Scripting HTL Java Compiler 1.0.23-1.3.1-SNAPSHOT
[INFO] ------------------------------------------------------------------------
[INFO] Downloading: https://repo.maven.apache.org/maven2/org/apache/sling/org.apache.sling.scripting.sightly.compiler/1.0.20-1.3.1/org.apache.sling.scripting.sightly.compiler-1.0.20-1.3.1.pom
[WARNING] The POM for org.apache.sling:org.apache.sling.scripting.sightly.compiler:jar:1.0.20-1.3.1
is missing, no dependency information available
[INFO] Downloading: https://repo.maven.apache.org/maven2/org/apache/sling/org.apache.sling.scripting.sightly.compiler/1.0.20-1.3.1/org.apache.sling.scripting.sightly.compiler-1.0.20-1.3.1.jar
[JENKINS] Archiving disabled
[JENKINS] Archiving disabled
[INFO] ------------------------------------------------------------------------
[INFO] BUILD FAILURE
[INFO] ------------------------------------------------------------------------
[INFO] Total time: 15.807 s
[INFO] Finished at: 2018-01-25T07:41:26+00:00
[INFO] Final Memory: 26M/414M
[INFO] ------------------------------------------------------------------------
[ERROR] Failed to execute goal on project org.apache.sling.scripting.sightly.compiler.java:
Could not resolve dependencies for project org.apache.sling:org.apache.sling.scripting.sightly.compiler.java:bundle:1.0.23-1.3.1-SNAPSHOT:
Could not find artifact org.apache.sling:org.apache.sling.scripting.sightly.compiler:jar:1.0.20-1.3.1
in central (https://repo.maven.apache.org/maven2) -> [Help 1]
[ERROR] 
[ERROR] To see the full stack trace of the errors, re-run Maven with the -e switch.
[ERROR] Re-run Maven using the -X switch to enable full debug logging.
[ERROR] 
[ERROR] For more information about the errors and possible solutions, please read the following
articles:
[ERROR] [Help 1] http://cwiki.apache.org/confluence/display/MAVEN/DependencyResolutionException
channel stopped
Recording test results

Mime
View raw message