sling-commits mailing list archives

Site index · List index
Message view « Date » · « Thread »
Top « Date » · « Thread »
From Apache Jenkins Server <jenk...@builds.apache.org>
Subject Build failed in Jenkins: sling-org-apache-sling-launchpad-testing-10 #8
Date Tue, 23 Jan 2018 02:59:39 GMT
See <https://builds.apache.org/job/sling-org-apache-sling-launchpad-testing-10/8/display/redirect>

------------------------------------------
Started by upstream project "sling-org-apache-sling-launchpad-integration-tests-1.8" build
number 24
originally caused by:
 Started by timer
[EnvInject] - Loading node environment variables.
Building remotely on ubuntu-4 (ubuntu trusty) in workspace <https://builds.apache.org/job/sling-org-apache-sling-launchpad-testing-10/ws/>
 > git rev-parse --is-inside-work-tree # timeout=10
Fetching changes from the remote Git repository
 > git config remote.origin.url https://github.com/apache/sling-org-apache-sling-launchpad-testing.git
# timeout=10
Fetching upstream changes from https://github.com/apache/sling-org-apache-sling-launchpad-testing.git
 > git --version # timeout=10
 > git fetch --tags --progress https://github.com/apache/sling-org-apache-sling-launchpad-testing.git
+refs/heads/*:refs/remotes/origin/*
 > git rev-parse origin/master^{commit} # timeout=10
Checking out Revision 8325d11b2c094ab9fef235abc07e6f1c7c915f50 (origin/master)
 > git config core.sparsecheckout # timeout=10
 > git checkout -f 8325d11b2c094ab9fef235abc07e6f1c7c915f50
Commit message: "SLING-7353 Update to Sling Parent 33"
 > git rev-list 8325d11b2c094ab9fef235abc07e6f1c7c915f50 # timeout=10
Parsing POMs
Established TCP socket on 52907
maven33-agent.jar already up to date
maven33-interceptor.jar already up to date
maven3-interceptor-commons.jar already up to date
[sling-org-apache-sling-launchpad-testing-10] $ /home/jenkins/tools/java/jdk-10-ea+36/bin/java
-Xmx2g -Xms256m -cp /home/jenkins/jenkins-slave/maven33-agent.jar:/home/jenkins/tools/maven/apache-maven-3.3.9/boot/plexus-classworlds-2.5.2.jar:/home/jenkins/tools/maven/apache-maven-3.3.9/conf/logging
jenkins.maven3.agent.Maven33Main /home/jenkins/tools/maven/apache-maven-3.3.9 /home/jenkins/jenkins-slave/slave.jar
/home/jenkins/jenkins-slave/maven33-interceptor.jar /home/jenkins/jenkins-slave/maven3-interceptor-commons.jar
52907
<===[JENKINS REMOTING CAPACITY]===>   channel started
WARNING: An illegal reflective access operation has occurred
WARNING: Illegal reflective access by hudson.remoting.RemoteClassLoader (file:/home/jenkins/jenkins-slave/slave.jar)
to method java.lang.ClassLoader.getClassLoadingLock(java.lang.String)
WARNING: Please consider reporting this to the maintainers of hudson.remoting.RemoteClassLoader
WARNING: Use --illegal-access=warn to enable warnings of further illegal reflective access
operations
WARNING: All illegal access operations will be denied in a future release
Executing Maven:  -B -f <https://builds.apache.org/job/sling-org-apache-sling-launchpad-testing-10/ws/pom.xml>
-Dmaven.repo.local=/home/jenkins/jenkins-slave/maven-repositories/1 -U clean verify
[INFO] Scanning for projects...
[INFO] Downloading: http://repository.apache.org/snapshots/org/apache/sling/org.apache.sling.launchpad.test-bundles/0.0.5-SNAPSHOT/maven-metadata.xml
[INFO] Downloaded: http://repository.apache.org/snapshots/org/apache/sling/org.apache.sling.launchpad.test-bundles/0.0.5-SNAPSHOT/maven-metadata.xml
(1019 B at 2.1 KB/sec)
[INFO] Downloading: http://repository.apache.org/snapshots/org/apache/sling/org.apache.sling.starter/11-SNAPSHOT/maven-metadata.xml
[INFO] Downloaded: http://repository.apache.org/snapshots/org/apache/sling/org.apache.sling.starter/11-SNAPSHOT/maven-metadata.xml
(2 KB at 4.1 KB/sec)
[INFO] Extended Maven classpath (scope 'provided') by the dependencies extracted from the
Sling model.
[INFO]                                                                         
[INFO] ------------------------------------------------------------------------
[INFO] Building Apache Sling Launchpad Testing 11-SNAPSHOT
[INFO] ------------------------------------------------------------------------
[INFO] Downloading: http://repository.apache.org/snapshots/org/apache/sling/org.apache.sling.launchpad.integration-tests/1.0.7-SNAPSHOT/maven-metadata.xml
[INFO] Downloaded: http://repository.apache.org/snapshots/org/apache/sling/org.apache.sling.launchpad.integration-tests/1.0.7-SNAPSHOT/maven-metadata.xml
(1 KB at 3.2 KB/sec)
[INFO] Downloading: http://repository.apache.org/snapshots/org/apache/sling/org.apache.sling.launchpad.integration-tests/1.0.7-SNAPSHOT/org.apache.sling.launchpad.integration-tests-1.0.7-20180123.025730-3.pom
[INFO] Downloaded: http://repository.apache.org/snapshots/org/apache/sling/org.apache.sling.launchpad.integration-tests/1.0.7-SNAPSHOT/org.apache.sling.launchpad.integration-tests-1.0.7-20180123.025730-3.pom
(12 KB at 36.7 KB/sec)
[INFO] Downloading: http://repository.apache.org/snapshots/org/apache/sling/org.apache.sling.launchpad.test-services/2.0.15-SNAPSHOT/maven-metadata.xml
[INFO] Downloaded: http://repository.apache.org/snapshots/org/apache/sling/org.apache.sling.launchpad.test-services/2.0.15-SNAPSHOT/maven-metadata.xml
(1 KB at 3.2 KB/sec)
[INFO] Downloading: http://repository.apache.org/snapshots/org/apache/sling/org.apache.sling.launchpad.test-fragment/2.0.15-SNAPSHOT/maven-metadata.xml
[INFO] Downloaded: http://repository.apache.org/snapshots/org/apache/sling/org.apache.sling.launchpad.test-fragment/2.0.15-SNAPSHOT/maven-metadata.xml
(1 KB at 3.2 KB/sec)
[INFO] Downloading: http://repository.apache.org/snapshots/org/apache/sling/org.apache.sling.launchpad.test-services-war/2.0.15-SNAPSHOT/maven-metadata.xml
[INFO] Downloaded: http://repository.apache.org/snapshots/org/apache/sling/org.apache.sling.launchpad.test-services-war/2.0.15-SNAPSHOT/maven-metadata.xml
(2 KB at 3.2 KB/sec)
[INFO] Downloading: http://repository.apache.org/snapshots/org/apache/sling/org.apache.sling.launchpad.integration-tests/1.0.7-SNAPSHOT/org.apache.sling.launchpad.integration-tests-1.0.7-20180123.025730-3.jar
[INFO] Downloaded: http://repository.apache.org/snapshots/org/apache/sling/org.apache.sling.launchpad.integration-tests/1.0.7-SNAPSHOT/org.apache.sling.launchpad.integration-tests-1.0.7-20180123.025730-3.jar
(485 KB at 718.0 KB/sec)
[INFO] 
[INFO] --- maven-clean-plugin:3.0.0:clean (default-clean) @ org.apache.sling.launchpad.testing
---
[INFO] Deleting <https://builds.apache.org/job/sling-org-apache-sling-launchpad-testing-10/ws/target>
[INFO] 
[INFO] --- maven-enforcer-plugin:3.0.0-M1:enforce (enforce-property-values) @ org.apache.sling.launchpad.testing
---
[INFO] 
[INFO] --- maven-enforcer-plugin:3.0.0-M1:enforce (enforce-java) @ org.apache.sling.launchpad.testing
---
[INFO] 
[INFO] --- maven-enforcer-plugin:3.0.0-M1:enforce (ban-maven-scr-plugin) @ org.apache.sling.launchpad.testing
---
[INFO] 
[INFO] --- maven-remote-resources-plugin:1.5:process (process-resource-bundles) @ org.apache.sling.launchpad.testing
---
[INFO] 
[INFO] --- maven-remote-resources-plugin:1.5:process (default) @ org.apache.sling.launchpad.testing
---
[INFO] 
[INFO] --- maven-resources-plugin:2.7:resources (default-resources) @ org.apache.sling.launchpad.testing
---
[INFO] Using 'UTF-8' encoding to copy filtered resources.
[INFO] skip non existing resourceDirectory <https://builds.apache.org/job/sling-org-apache-sling-launchpad-testing-10/ws/src/main/resources>
[INFO] Copying 3 resources
[INFO] Copying 3 resources
[INFO] 
[INFO] --- build-helper-maven-plugin:3.0.0:reserve-network-port (reserve-network-port) @ org.apache.sling.launchpad.testing
---
[INFO] Port assigned41000
[INFO] Reserved port 41000 for http.port
[INFO] Port assigned41001
[INFO] Reserved port 41001 for sling.control.port
[INFO] 
[INFO] --- maven-compiler-plugin:3.7.0:compile (default-compile) @ org.apache.sling.launchpad.testing
---
[INFO] No sources to compile
[INFO] 
[INFO] --- maven-resources-plugin:2.7:testResources (default-testResources) @ org.apache.sling.launchpad.testing
---
[INFO] Using 'UTF-8' encoding to copy filtered resources.
[INFO] Copying 1 resource
[INFO] Copying 3 resources
[INFO] Copying 3 resources
[INFO] 
[INFO] --- maven-compiler-plugin:3.7.0:testCompile (default-testCompile) @ org.apache.sling.launchpad.testing
---
[INFO] No sources to compile
[INFO] 
[INFO] --- maven-surefire-plugin:2.20.1:test (default-test) @ org.apache.sling.launchpad.testing
---
[JENKINS] Recording test results
[INFO] 
[INFO] --- slingstart-maven-plugin:1.7.16:prepare-package (default-prepare-package) @ org.apache.sling.launchpad.testing
---
[INFO] 
[INFO] --- slingstart-maven-plugin:1.7.16:attach-slingfeature (default-attach-slingfeature)
@ org.apache.sling.launchpad.testing ---
[INFO] 
[INFO] --- slingstart-maven-plugin:1.7.16:package (default-package) @ org.apache.sling.launchpad.testing
---
[INFO] Packaging standalone jar...
[INFO] Building zip: <https://builds.apache.org/job/sling-org-apache-sling-launchpad-testing-10/ws/target/org.apache.sling.launchpad.testing-11-SNAPSHOT.jar>
[INFO] 
[INFO] >>> maven-source-plugin:3.0.1:jar (attach-sources) > generate-sources @
org.apache.sling.launchpad.testing >>>
[INFO] 
[INFO] --- maven-enforcer-plugin:3.0.0-M1:enforce (enforce-property-values) @ org.apache.sling.launchpad.testing
---
[INFO] 
[INFO] --- maven-enforcer-plugin:3.0.0-M1:enforce (enforce-java) @ org.apache.sling.launchpad.testing
---
[INFO] 
[INFO] --- maven-enforcer-plugin:3.0.0-M1:enforce (ban-maven-scr-plugin) @ org.apache.sling.launchpad.testing
---
[WARNING] Failed to getClass for org.apache.maven.plugins.source.SourceJarMojo
[INFO] 
[INFO] <<< maven-source-plugin:3.0.1:jar (attach-sources) < generate-sources @
org.apache.sling.launchpad.testing <<<
[INFO] 
[INFO] --- maven-source-plugin:3.0.1:jar (attach-sources) @ org.apache.sling.launchpad.testing
---
[INFO] Building jar: <https://builds.apache.org/job/sling-org-apache-sling-launchpad-testing-10/ws/target/org.apache.sling.launchpad.testing-11-SNAPSHOT-sources.jar>
[INFO] 
[INFO] --- maven-site-plugin:3.5.1:attach-descriptor (attach-descriptor) @ org.apache.sling.launchpad.testing
---
[INFO] 
[INFO] --- slingstart-maven-plugin:1.7.16:start (start-container) @ org.apache.sling.launchpad.testing
---
[INFO] Using launchpad jar being generated as this project's primary artifact: '<https://builds.apache.org/job/sling-org-apache-sling-launchpad-testing-10/ws/target/org.apache.sling.launchpad.testing-11-SNAPSHOT.jar'!>
[INFO] Starting Launchpad _-41000...
-------------------------------------------------------------------
Slingstart application: <https://builds.apache.org/job/sling-org-apache-sling-launchpad-testing-10/ws/target/_-41000/org.apache.sling.launchpad.testing-11-SNAPSHOT.jar>
Main class: org.apache.sling.launchpad.app.Main
Listener Port: 36955
Arguments: [-p, 41000, -j, 41001]
-------------------------------------------------------------------
23.01.2018 02:59:19.775 *INFO * [main] Setting sling.home=sling (default)
23.01.2018 02:59:19.779 *INFO * [main] Starting Apache Sling in <https://builds.apache.org/job/sling-org-apache-sling-launchpad-testing-10/ws/target/_-41000/sling>
23.01.2018 02:59:19.782 *INFO * [main] Sling  Extension Lib Home : <https://builds.apache.org/job/sling-org-apache-sling-launchpad-testing-10/ws/target/_-41000/sling/ext>
23.01.2018 02:59:19.783 *INFO * [main] Checking launcher JAR in folder <https://builds.apache.org/job/sling-org-apache-sling-launchpad-testing-10/ws/target/_-41000/sling>
23.01.2018 02:59:19.796 *INFO * [main] Installing new launcher: jar:<https://builds.apache.org/job/sling-org-apache-sling-launchpad-testing-10/ws/target/_-41000/org.apache.sling.launchpad.testing-11-SNAPSHOT.jar!/resources/org.apache.sling.launchpad.base.jar,>
5.6.10.2_6_26 (org.apache.sling.launchpad.base.jar.1516676359795)
23.01.2018 02:59:19.797 *INFO * [main] Loading launcher class org.apache.sling.launchpad.base.app.MainDelegate
from org.apache.sling.launchpad.base.jar.1516676359795
23.01.2018 02:59:19.797 *INFO * [main] External Libs Home (ext) is null or does not exists.
23.01.2018 02:59:19.811 *INFO * [main] Setting sling.launchpad=<https://builds.apache.org/job/sling-org-apache-sling-launchpad-testing-10/ws/target/_-41000/sling>
23.01.2018 02:59:19.811 *INFO * [main] Setting org.osgi.service.http.port=41000
23.01.2018 02:59:19.811 *INFO * [main] Setting sling.control.socket=41001
23.01.2018 02:59:19.811 *INFO * [main] Starting launcher ...
23.01.2018 02:59:19.821 *INFO * [main] HTTP server port: 41000
WARNING: An illegal reflective access operation has occurred
WARNING: Illegal reflective access by org.apache.felix.framework.ext.ClassPathExtenderFactory$DefaultClassLoaderExtender
(<https://builds.apache.org/job/sling-org-apache-sling-launchpad-testing-10/ws/target/_-41000/sling/org.apache.sling.launchpad.base.jar.1516676359795)>
to method java.net.URLClassLoader.addURL(java.net.URL)
WARNING: Please consider reporting this to the maintainers of org.apache.felix.framework.ext.ClassPathExtenderFactory$DefaultClassLoaderExtender
WARNING: Use --illegal-access=warn to enable warnings of further illegal reflective access
operations
WARNING: All illegal access operations will be denied in a future release
23.01.2018 02:59:20.642 *INFO* [OsgiInstallerImpl] org.apache.sling.installer.core.impl.OsgiInstallerImpl
Apache Sling OSGi Installer Service started.
23.01.2018 02:59:20.685 *INFO* [FelixStartLevel] org.apache.sling.commons.logservice Service
[org.apache.sling.commons.logservice.internal.LogServiceFactory,17, [org.osgi.service.log.LogService]]
ServiceEvent REGISTERED
23.01.2018 02:59:20.690 *INFO* [FelixStartLevel] org.apache.sling.commons.logservice Service
[org.apache.sling.commons.logservice.internal.LogReaderServiceFactory,18, [org.osgi.service.log.LogReaderService]]
ServiceEvent REGISTERED
23.01.2018 02:59:20.690 *INFO* [FelixStartLevel] org.apache.sling.commons.logservice BundleEvent
STARTED
23.01.2018 02:59:20.697 *INFO* [FelixStartLevel] org.apache.sling.launchpad.installer BundleEvent
RESOLVED
23.01.2018 02:59:20.700 *INFO* [FelixStartLevel] org.apache.sling.launchpad.installer BundleEvent
STARTING
23.01.2018 02:59:20.702 *INFO* [FelixStartLevel] org.apache.sling.launchpad.installer BundleEvent
STARTED
23.01.2018 02:59:20.704 *INFO* [FelixStartLevel] org.apache.geronimo.specs.geronimo-atinject_1.0_spec
BundleEvent RESOLVED
23.01.2018 02:59:20.705 *INFO* [FelixStartLevel] org.apache.geronimo.specs.geronimo-atinject_1.0_spec
BundleEvent STARTING
23.01.2018 02:59:20.705 *INFO* [FelixStartLevel] org.apache.geronimo.specs.geronimo-atinject_1.0_spec
BundleEvent STARTED
23.01.2018 02:59:20.706 *INFO* [FelixStartLevel] org.apache.sling.settings BundleEvent STARTING
23.01.2018 02:59:20.711 *INFO* [FelixStartLevel] org.apache.sling.settings.impl.SlingSettingsServiceImpl
Read Sling ID null from file <https://builds.apache.org/job/sling-org-apache-sling-launchpad-testing-10/ws/target/_-41000/sling/felix/bundle16/data/sling.id.file>
23.01.2018 02:59:20.714 *INFO* [FelixStartLevel] org.apache.sling.settings.impl.SlingSettingsServiceImpl
Created new Sling ID c51b2576-8d39-4e1b-83ea-7ca9b114b997
23.01.2018 02:59:20.718 *INFO* [FelixStartLevel] org.apache.sling.settings.impl.SlingSettingsServiceImpl
Active run modes: [oak_tar]
23.01.2018 02:59:20.719 *INFO* [FelixStartLevel] org.apache.sling.launchpad.installer Service
[Apache Sling Launchpad Startup Listener,20, [org.apache.sling.installer.api.event.InstallationListener]]
ServiceEvent REGISTERED
23.01.2018 02:59:20.720 *INFO* [FelixStartLevel] org.apache.sling.launchpad.installer.impl.LaunchpadConfigInstaller
Activating launchpad config installer, configuration path=resources/config, install path=resources/install
23.01.2018 02:59:20.938 *INFO* [FelixStartLevel] org.apache.sling.launchpad.installer.impl.LaunchpadConfigInstaller
182 resources registered with OsgiInstaller
23.01.2018 02:59:20.943 *INFO* [FelixStartLevel] org.apache.sling.settings Service [Apache
Sling Settings Service,19, [org.apache.sling.settings.SlingSettingsService]] ServiceEvent
REGISTERED
23.01.2018 02:59:20.945 *INFO* [FelixStartLevel] org.apache.sling.settings Service [Apache
Sling Sling Properties Configuration Printer,21, [org.apache.sling.settings.impl.SlingPropertiesPrinter]]
ServiceEvent REGISTERED
23.01.2018 02:59:20.946 *INFO* [FelixStartLevel] org.apache.sling.settings Service [Apache
Sling Sling Settings Configuration Printer,22, [org.apache.sling.settings.impl.SlingSettingsPrinter]]
ServiceEvent REGISTERED
23.01.2018 02:59:20.948 *INFO* [FelixStartLevel] org.apache.sling.settings Service [org.apache.sling.settings.impl.SlingSettingsServiceImpl,23,
[org.osgi.service.cm.ManagedService]] ServiceEvent REGISTERED
23.01.2018 02:59:20.948 *INFO* [FelixStartLevel] org.apache.sling.settings BundleEvent STARTED
23.01.2018 02:59:20.953 *INFO* [FelixStartLevel] org.apache.aries.util BundleEvent RESOLVED
23.01.2018 02:59:20.953 *INFO* [FelixStartLevel] org.apache.aries.util BundleEvent STARTING
23.01.2018 02:59:20.954 *INFO* [FelixStartLevel] org.apache.aries.util BundleEvent STARTED
23.01.2018 02:59:20.956 *INFO* [FelixStartLevel] org.apache.sling.commons.log BundleEvent
STARTING
23.01.2018 02:59:20.989 *INFO* [FelixStartLevel] org.apache.sling.commons.log Service [org.apache.sling.commons.log.LogManager,24,
[org.osgi.service.cm.ManagedService]] ServiceEvent REGISTERED
23.01.2018 02:59:20.994 *INFO* [FelixStartLevel] org.apache.sling.commons.log Service [org.apache.sling.commons.log.LogManager.factory.writer,25,
[org.osgi.service.cm.ManagedServiceFactory]] ServiceEvent REGISTERED
23.01.2018 02:59:20.996 *INFO* [FelixStartLevel] org.apache.sling.commons.log Service [org.apache.sling.commons.log.LogManager.factory.config,26,
[org.osgi.service.cm.ManagedServiceFactory]] ServiceEvent REGISTERED
23.01.2018 02:59:21.001 *INFO* [FelixStartLevel] org.apache.sling.commons.log Service [Sling
Log Panel Support,27, [org.apache.sling.commons.log.logback.webconsole.LogPanel]] ServiceEvent
REGISTERED
23.01.2018 02:59:21.003 *INFO* [FelixStartLevel] org.apache.sling.commons.log Service [Sling
Log Configuration Printer,28, [org.apache.sling.commons.log.logback.internal.SlingConfigurationPrinter]]
ServiceEvent REGISTERED
23.01.2018 02:59:21.013 *INFO* [FelixStartLevel] org.apache.sling.commons.log Service [Sling
Log Reset Event Handler,29, [org.osgi.service.event.EventHandler]] ServiceEvent REGISTERED
23.01.2018 02:59:21.050 *INFO * [main] Startup completed
23.01.2018 02:59:21.167 *INFO* [OsgiInstallerImpl] org.apache.sling.audit.osgi.installer Installed
configuration org.apache.sling.jcr.base.internal.LoginAdminWhitelist.fragment.f5d7ee67-351c-43f0-acdd-d4c5f722b5c0
from resource TaskResource(url=launchpad:resources/config/org.apache.sling.jcr.base.internal.LoginAdminWhitelist.fragment-sling.config,
entity=config:org.apache.sling.jcr.base.internal.LoginAdminWhitelist.fragment.sling, state=INSTALL,
attributes=[org.apache.sling.installer.api.tasks.ResourceTransformer=:16:, service.factoryPid=org.apache.sling.jcr.base.internal.LoginAdminWhitelist.fragment,
service.pid=sling], digest=b57bfd8d9f92019f6166ea7005255d38)
23.01.2018 02:59:21.169 *INFO* [OsgiInstallerImpl] org.apache.sling.audit.osgi.installer Installed
configuration org.apache.sling.jcr.davex.impl.servlets.SlingDavExServlet from resource TaskResource(url=launchpad:resources/config/org.apache.sling.jcr.davex.impl.servlets.SlingDavExServlet.config,
entity=config:org.apache.sling.jcr.davex.impl.servlets.SlingDavExServlet, state=INSTALL, attributes=[org.apache.sling.installer.api.tasks.ResourceTransformer=:16:,
service.pid=org.apache.sling.jcr.davex.impl.servlets.SlingDavExServlet], digest=ee3357fb8cc76c8d77dfa8b61bc29ef3)
23.01.2018 02:59:21.170 *INFO* [OsgiInstallerImpl] org.apache.sling.audit.osgi.installer Installed
configuration org.apache.sling.jcr.repoinit.impl.RepositoryInitializer from resource TaskResource(url=launchpad:resources/config/org.apache.sling.jcr.repoinit.impl.RepositoryInitializer.config,
entity=config:org.apache.sling.jcr.repoinit.impl.RepositoryInitializer, state=INSTALL, attributes=[org.apache.sling.installer.api.tasks.ResourceTransformer=:16:,
service.pid=org.apache.sling.jcr.repoinit.impl.RepositoryInitializer], digest=62590adee787f806d60b246345ae4991)
23.01.2018 02:59:21.172 *INFO* [OsgiInstallerImpl] org.apache.sling.audit.osgi.installer Installed
configuration org.apache.sling.jcr.webdav.impl.servlets.SimpleWebDavServlet from resource
TaskResource(url=launchpad:resources/config/org.apache.sling.jcr.webdav.impl.servlets.SimpleWebDavServlet.config,
entity=config:org.apache.sling.jcr.webdav.impl.servlets.SimpleWebDavServlet, state=INSTALL,
attributes=[org.apache.sling.installer.api.tasks.ResourceTransformer=:16:, service.pid=org.apache.sling.jcr.webdav.impl.servlets.SimpleWebDavServlet],
digest=40b06a2412e7e842f149163de5a9ae75)
23.01.2018 02:59:21.173 *INFO* [OsgiInstallerImpl] org.apache.sling.audit.osgi.installer Installed
configuration org.apache.sling.scripting.core.impl.ScriptCacheImpl from resource TaskResource(url=launchpad:resources/config/org.apache.sling.scripting.core.impl.ScriptCacheImpl.config,
entity=config:org.apache.sling.scripting.core.impl.ScriptCacheImpl, state=INSTALL, attributes=[org.apache.sling.installer.api.tasks.ResourceTransformer=:16:,
service.pid=org.apache.sling.scripting.core.impl.ScriptCacheImpl], digest=13b57519a048a6c8873ed61949d013f6)
23.01.2018 02:59:21.175 *INFO* [OsgiInstallerImpl] org.apache.sling.audit.osgi.installer Installed
configuration org.apache.sling.serviceusermapping.impl.ServiceUserMapperImpl.amended.ef89eb4a-3262-4b9a-9680-295a0742137b
from resource TaskResource(url=launchpad:resources/config/org.apache.sling.serviceusermapping.impl.ServiceUserMapperImpl.amended-i18n.config,
entity=config:org.apache.sling.serviceusermapping.impl.ServiceUserMapperImpl.amended.i18n,
state=INSTALL, attributes=[org.apache.sling.installer.api.tasks.ResourceTransformer=:16:,
service.factoryPid=org.apache.sling.serviceusermapping.impl.ServiceUserMapperImpl.amended,
service.pid=i18n], digest=5ca453becbd0de7378d7d5707823f9a8)
23.01.2018 02:59:21.180 *INFO* [OsgiInstallerImpl] org.apache.sling.audit.osgi.installer Installed
configuration org.apache.sling.serviceusermapping.impl.ServiceUserMapperImpl.amended.313c7ee5-d6a7-43de-be6f-957d35ff280d
from resource TaskResource(url=launchpad:resources/config/org.apache.sling.serviceusermapping.impl.ServiceUserMapperImpl.amended-jcr-resource.config,
entity=config:org.apache.sling.serviceusermapping.impl.ServiceUserMapperImpl.amended.jcr-resource,
state=INSTALL, attributes=[org.apache.sling.installer.api.tasks.ResourceTransformer=:16:,
service.factoryPid=org.apache.sling.serviceusermapping.impl.ServiceUserMapperImpl.amended,
service.pid=jcr-resource], digest=8b9c2b1535ffb961711fa342f873d589)
23.01.2018 02:59:21.182 *INFO* [OsgiInstallerImpl] org.apache.sling.audit.osgi.installer Installed
configuration org.apache.sling.serviceusermapping.impl.ServiceUserMapperImpl.amended.26712aa1-f878-4ecc-9220-2eb675c1629d
from resource TaskResource(url=launchpad:resources/config/org.apache.sling.serviceusermapping.impl.ServiceUserMapperImpl.amended-observation.config,
entity=config:org.apache.sling.serviceusermapping.impl.ServiceUserMapperImpl.amended.observation,
state=INSTALL, attributes=[org.apache.sling.installer.api.tasks.ResourceTransformer=:16:,
service.factoryPid=org.apache.sling.serviceusermapping.impl.ServiceUserMapperImpl.amended,
service.pid=observation], digest=b358fca04fc5775b5fee0983520f157b)
23.01.2018 02:59:21.184 *INFO* [OsgiInstallerImpl] org.apache.sling.audit.osgi.installer Installed
configuration org.apache.sling.serviceusermapping.impl.ServiceUserMapperImpl.amended.8459235f-a28a-4ac1-b128-cc07bfd257f0
from resource TaskResource(url=launchpad:resources/config/org.apache.sling.serviceusermapping.impl.ServiceUserMapperImpl.amended-resourceresolver.config,
entity=config:org.apache.sling.serviceusermapping.impl.ServiceUserMapperImpl.amended.resourceresolver,
state=INSTALL, attributes=[org.apache.sling.installer.api.tasks.ResourceTransformer=:16:,
service.factoryPid=org.apache.sling.serviceusermapping.impl.ServiceUserMapperImpl.amended,
service.pid=resourceresolver], digest=d317bcbc20315e21bdbb0480199d7a55)
23.01.2018 02:59:21.186 *INFO* [OsgiInstallerImpl] org.apache.sling.audit.osgi.installer Installed
configuration org.apache.sling.serviceusermapping.impl.ServiceUserMapperImpl.amended.45562fd7-6db1-4576-b57a-101b98172f05
from resource TaskResource(url=launchpad:resources/config/org.apache.sling.serviceusermapping.impl.ServiceUserMapperImpl.amended-scripting.config,
entity=config:org.apache.sling.serviceusermapping.impl.ServiceUserMapperImpl.amended.scripting,
state=INSTALL, attributes=[org.apache.sling.installer.api.tasks.ResourceTransformer=:16:,
service.factoryPid=org.apache.sling.serviceusermapping.impl.ServiceUserMapperImpl.amended,
service.pid=scripting], digest=479bf62d1c800aa03dba13706319afd1)
23.01.2018 02:59:21.202 *INFO* [OsgiInstallerImpl] org.apache.sling.audit.osgi.installer Installed
configuration org.apache.sling.serviceusermapping.impl.ServiceUserMapperImpl.amended.3d382a04-3799-4678-88c3-9225b54826a0
from resource TaskResource(url=launchpad:resources/config/org.apache.sling.serviceusermapping.impl.ServiceUserMapperImpl.amended-servletsresolver.config,
entity=config:org.apache.sling.serviceusermapping.impl.ServiceUserMapperImpl.amended.servletsresolver,
state=INSTALL, attributes=[org.apache.sling.installer.api.tasks.ResourceTransformer=:16:,
service.factoryPid=org.apache.sling.serviceusermapping.impl.ServiceUserMapperImpl.amended,
service.pid=servletsresolver], digest=36b119a784d011be61d06b5de31d4753)
23.01.2018 02:59:21.210 *INFO* [OsgiInstallerImpl] org.apache.sling.audit.osgi.installer Installed
configuration org.apache.sling.serviceusermapping.impl.ServiceUserMapperImpl.amended.273aa6be-6144-43d4-a384-2d1376cb4103
from resource TaskResource(url=launchpad:resources/config/org.apache.sling.serviceusermapping.impl.ServiceUserMapperImpl.amended-sling-caconfig.config,
entity=config:org.apache.sling.serviceusermapping.impl.ServiceUserMapperImpl.amended.sling-caconfig,
state=INSTALL, attributes=[org.apache.sling.installer.api.tasks.ResourceTransformer=:16:,
service.factoryPid=org.apache.sling.serviceusermapping.impl.ServiceUserMapperImpl.amended,
service.pid=sling-caconfig], digest=f21cac1a9c2ba6661442ce589b9242f3)
Jan 23, 2018 2:59:23 AM org.apache.tika.config.InitializableProblemHandler$3 handleInitializableProblem
WARNING: JBIG2ImageReader not loaded. jbig2 files will be ignored
See https://pdfbox.apache.org/2.0/dependencies.html#jai-image-io
for optional dependencies.
TIFFImageWriter not loaded. tiff files will not be processed
See https://pdfbox.apache.org/2.0/dependencies.html#jai-image-io
for optional dependencies.
J2KImageReader not loaded. JPEG2000 files will not be processed.
See https://pdfbox.apache.org/2.0/dependencies.html#jai-image-io
for optional dependencies.

Jan 23, 2018 2:59:23 AM org.apache.tika.config.InitializableProblemHandler$3 handleInitializableProblem
WARNING: org.xerial's sqlite-jdbc is not loaded.
Please provide the jar on your classpath to parse sqlite files.
See tika-parsers/pom.xml for the correct version.
[INFO] Started Launchpad '_-41000' at port 41000 [run modes: null]
[INFO] 
[INFO] --- maven-failsafe-plugin:2.20.1:integration-test (default) @ org.apache.sling.launchpad.testing
---
[JENKINS] Recording test results
[JENKINS] Archiving disabled
[JENKINS] Archiving disabled
[INFO] ------------------------------------------------------------------------
[INFO] BUILD FAILURE
[INFO] ------------------------------------------------------------------------
[INFO] Total time: 01:00 min
[INFO] Finished at: 2018-01-23T02:59:29+00:00
[INFO] Final Memory: 41M/256M
[INFO] ------------------------------------------------------------------------
Waiting for Jenkins to finish collecting data
[ERROR] Failed to execute goal org.apache.maven.plugins:maven-failsafe-plugin:2.20.1:integration-test
(default) on project org.apache.sling.launchpad.testing: Execution default of goal org.apache.maven.plugins:maven-failsafe-plugin:2.20.1:integration-test
failed. NullPointerException -> [Help 1]
[ERROR] 
[ERROR] To see the full stack trace of the errors, re-run Maven with the -e switch.
[ERROR] Re-run Maven using the -X switch to enable full debug logging.
[ERROR] 
[ERROR] For more information about the errors and possible solutions, please read the following
articles:
[ERROR] [Help 1] http://cwiki.apache.org/confluence/display/MAVEN/PluginExecutionException
channel stopped
Terminating launchpad _-41000
23.01.2018 02:59:35.447 *INFO * [Apache Sling Terminator] Java VM is shutting down
23.01.2018 02:59:35.454 *INFO * [Apache Sling Terminator] Stopping Apache Sling
Archiving artifacts
ERROR: Failed to archive {target/_-41000/sling/logs/request.log=target/_-41000/sling/logs/request.log,
target/_-41000/sling/logs/access.log=target/_-41000/sling/logs/access.log, target/_-41000/sling/logs/error.log=target/_-41000/sling/logs/error.log}
due to internal error; falling back to full archiving
java.lang.IllegalStateException: checksum mismatch after transfer (3617285710227059248 vs.
885636149); /x1/jenkins/jenkins-home/jobs/sling-org-apache-sling-launchpad-testing-10/builds/8/archive/target/_-41000/sling/logs/error.log
may be corrupted
	at jsync.protocol.FileSequenceReader.read(FileSequenceReader.java:45)
	at com.cloudbees.jenkins.plugins.jsync.archiver.JSyncArtifactManager.remoteSync(JSyncArtifactManager.java:158)
	at com.cloudbees.jenkins.plugins.jsync.archiver.JSyncArtifactManager.archive(JSyncArtifactManager.java:76)
	at hudson.tasks.ArtifactArchiver.perform(ArtifactArchiver.java:245)
	at hudson.tasks.BuildStepCompatibilityLayer.perform(BuildStepCompatibilityLayer.java:81)
	at hudson.tasks.BuildStepMonitor$1.perform(BuildStepMonitor.java:20)
	at hudson.model.AbstractBuild$AbstractBuildExecution.perform(AbstractBuild.java:744)
	at hudson.model.AbstractBuild$AbstractBuildExecution.performAllBuildSteps(AbstractBuild.java:690)
	at hudson.maven.MavenModuleSetBuild$MavenModuleSetBuildExecution.post2(MavenModuleSetBuild.java:1073)
	at hudson.model.AbstractBuild$AbstractBuildExecution.post(AbstractBuild.java:635)
	at hudson.model.Run.execute(Run.java:1749)
	at hudson.maven.MavenModuleSetBuild.run(MavenModuleSetBuild.java:543)
	at hudson.model.ResourceController.execute(ResourceController.java:97)
	at hudson.model.Executor.run(Executor.java:421)
Recording test results
23.01.2018 02:59:38.636 *INFO * [Sling Notifier] Apache Sling has been stopped

Mime
View raw message