sling-commits mailing list archives

Site index · List index
Message view « Date » · « Thread »
Top « Date » · « Thread »
From Apache Jenkins Server <jenk...@builds.apache.org>
Subject Build failed in Jenkins: sling-org-apache-sling-commons-cache-portal-1.8 #10
Date Mon, 11 Dec 2017 08:45:14 GMT
See <https://builds.apache.org/job/sling-org-apache-sling-commons-cache-portal-1.8/10/display/redirect>

------------------------------------------
Started by upstream project "sling-org-apache-sling-commons-cache-api-1.8" build number 5
originally caused by:
 Started by timer
[EnvInject] - Loading node environment variables.
Building remotely on H26 (ubuntu xenial) in workspace <https://builds.apache.org/job/sling-org-apache-sling-commons-cache-portal-1.8/ws/>
 > git rev-parse --is-inside-work-tree # timeout=10
Fetching changes from the remote Git repository
 > git config remote.origin.url https://github.com/apache/sling-org-apache-sling-commons-cache-portal.git
# timeout=10
Fetching upstream changes from https://github.com/apache/sling-org-apache-sling-commons-cache-portal.git
 > git --version # timeout=10
 > git fetch --tags --progress https://github.com/apache/sling-org-apache-sling-commons-cache-portal.git
+refs/heads/*:refs/remotes/origin/*
 > git rev-parse origin/master^{commit} # timeout=10
Checking out Revision 089669d5985d5bec28f306e3a048b32fc1b5c601 (origin/master)
 > git config core.sparsecheckout # timeout=10
 > git checkout -f 089669d5985d5bec28f306e3a048b32fc1b5c601
Commit message: "SLING-7213 - Add a default .gitignore file to every module"
 > git rev-list 089669d5985d5bec28f306e3a048b32fc1b5c601 # timeout=10
Parsing POMs
Established TCP socket on 46212
maven33-agent.jar already up to date
maven33-interceptor.jar already up to date
maven3-interceptor-commons.jar already up to date
[sling-org-apache-sling-commons-cache-portal-1.8] $ /home/jenkins/tools/java/latest1.8/bin/java
-Xmx2g -Xms256m -cp /home/jenkins/jenkins-slave/maven33-agent.jar:/home/jenkins/tools/maven/apache-maven-3.3.9/boot/plexus-classworlds-2.5.2.jar:/home/jenkins/tools/maven/apache-maven-3.3.9/conf/logging
jenkins.maven3.agent.Maven33Main /home/jenkins/tools/maven/apache-maven-3.3.9 /home/jenkins/jenkins-slave/slave.jar
/home/jenkins/jenkins-slave/maven33-interceptor.jar /home/jenkins/jenkins-slave/maven3-interceptor-commons.jar
46212
<===[JENKINS REMOTING CAPACITY]===>   channel started
Executing Maven:  -B -f <https://builds.apache.org/job/sling-org-apache-sling-commons-cache-portal-1.8/ws/pom.xml>
-Dmaven.repo.local=/home/jenkins/jenkins-slave/maven-repositories/1 -U clean deploy
[INFO] Scanning for projects...
[INFO]                                                                         
[INFO] ------------------------------------------------------------------------
[INFO] Building Apache Sling Cache Portal Cache 0.1-SNAPSHOT
[INFO] ------------------------------------------------------------------------
[INFO] Downloading: http://repository.apache.org/snapshots/org/apache/sling/org.apache.sling.commons.cache.api/0.1-SNAPSHOT/maven-metadata.xml
[INFO] Downloaded: http://repository.apache.org/snapshots/org/apache/sling/org.apache.sling.commons.cache.api/0.1-SNAPSHOT/maven-metadata.xml
(1010 B at 2.0 KB/sec)
[INFO] Downloading: http://repository.apache.org/snapshots/org/apache/sling/org.apache.sling.commons.cache.api/0.1-SNAPSHOT/org.apache.sling.commons.cache.api-0.1-20171211.084419-11.pom
[INFO] Downloaded: http://repository.apache.org/snapshots/org/apache/sling/org.apache.sling.commons.cache.api/0.1-SNAPSHOT/org.apache.sling.commons.cache.api-0.1-20171211.084419-11.pom
(3 KB at 7.1 KB/sec)
[INFO] Downloading: http://repository.apache.org/snapshots/org/apache/sling/portal/org.apache.sling.portal.container/0.6.0-SNAPSHOT/maven-metadata.xml
[INFO] Downloading: http://repository.apache.org/snapshots/org/apache/sling/portal/org.apache.sling.portal.container/0.6.0-SNAPSHOT/org.apache.sling.portal.container-0.6.0-SNAPSHOT.pom
[WARNING] The POM for org.apache.sling.portal:org.apache.sling.portal.container:jar:0.6.0-SNAPSHOT
is missing, no dependency information available
[INFO] Downloading: http://repository.apache.org/snapshots/org/apache/sling/org.apache.sling.commons.cache.api/0.1-SNAPSHOT/org.apache.sling.commons.cache.api-0.1-20171211.084419-11.jar
[INFO] Downloading: http://repository.apache.org/snapshots/org/apache/sling/portal/org.apache.sling.portal.container/0.6.0-SNAPSHOT/org.apache.sling.portal.container-0.6.0-SNAPSHOT.jar
[INFO] Downloaded: http://repository.apache.org/snapshots/org/apache/sling/org.apache.sling.commons.cache.api/0.1-SNAPSHOT/org.apache.sling.commons.cache.api-0.1-20171211.084419-11.jar
(12 KB at 29.8 KB/sec)
[JENKINS] Archiving disabled
[JENKINS] Archiving disabled
[INFO] ------------------------------------------------------------------------
[INFO] BUILD FAILURE
[INFO] ------------------------------------------------------------------------
[INFO] Total time: 8.727 s
[INFO] Finished at: 2017-12-11T08:45:13+00:00
[INFO] Final Memory: 14M/287M
[INFO] ------------------------------------------------------------------------
Waiting for Jenkins to finish collecting data
[ERROR] Failed to execute goal on project org.apache.sling.commons.cache.portal: Could not
resolve dependencies for project org.apache.sling:org.apache.sling.commons.cache.portal:bundle:0.1-SNAPSHOT:
Could not find artifact org.apache.sling.portal:org.apache.sling.portal.container:jar:0.6.0-SNAPSHOT
in Nexus (http://repository.apache.org/snapshots) -> [Help 1]
[ERROR] 
[ERROR] To see the full stack trace of the errors, re-run Maven with the -e switch.
[ERROR] Re-run Maven using the -X switch to enable full debug logging.
[ERROR] 
[ERROR] For more information about the errors and possible solutions, please read the following
articles:
[ERROR] [Help 1] http://cwiki.apache.org/confluence/display/MAVEN/DependencyResolutionException
channel stopped
Recording test results

Mime
View raw message