sling-commits mailing list archives

Site index · List index
Message view « Date » · « Thread »
Top « Date » · « Thread »
From Apache Jenkins Server <jenk...@builds.apache.org>
Subject Build failed in Jenkins: sling-org-apache-sling-launchpad-testing-war-9 #1
Date Thu, 09 Nov 2017 13:15:34 GMT
See <https://builds.apache.org/job/sling-org-apache-sling-launchpad-testing-war-9/1/display/redirect>

------------------------------------------
[...truncated 77.12 KB...]
Running org.apache.sling.launchpad.webapp.integrationtest.NodetypeRenderingTest
Tests run: 7, Failures: 0, Errors: 0, Skipped: 0, Time elapsed: 0.809 sec - in org.apache.sling.launchpad.webapp.integrationtest.NodetypeRenderingTest
Running org.apache.sling.launchpad.webapp.integrationtest.HttpPingTest
Tests run: 2, Failures: 0, Errors: 0, Skipped: 0, Time elapsed: 0.019 sec - in org.apache.sling.launchpad.webapp.integrationtest.HttpPingTest
Running org.apache.sling.launchpad.webapp.integrationtest.FiltersTest
Tests run: 1, Failures: 0, Errors: 0, Skipped: 0, Time elapsed: 0.012 sec - in org.apache.sling.launchpad.webapp.integrationtest.FiltersTest
Running org.apache.sling.launchpad.webapp.integrationtest.userManager.UpdateGroupTest
Tests run: 3, Failures: 0, Errors: 0, Skipped: 0, Time elapsed: 0.557 sec - in org.apache.sling.launchpad.webapp.integrationtest.userManager.UpdateGroupTest
Running org.apache.sling.launchpad.webapp.integrationtest.userManager.UpdateUserTest
Tests run: 7, Failures: 0, Errors: 0, Skipped: 0, Time elapsed: 0.608 sec - in org.apache.sling.launchpad.webapp.integrationtest.userManager.UpdateUserTest
Running org.apache.sling.launchpad.webapp.integrationtest.userManager.CreateUserTest
Tests run: 8, Failures: 0, Errors: 0, Skipped: 0, Time elapsed: 0.318 sec - in org.apache.sling.launchpad.webapp.integrationtest.userManager.CreateUserTest
Running org.apache.sling.launchpad.webapp.integrationtest.userManager.CreateGroupTest
Tests run: 5, Failures: 0, Errors: 0, Skipped: 0, Time elapsed: 0.305 sec - in org.apache.sling.launchpad.webapp.integrationtest.userManager.CreateGroupTest
Running org.apache.sling.launchpad.webapp.integrationtest.userManager.RemoveAuthorizablesTest
Tests run: 5, Failures: 0, Errors: 0, Skipped: 0, Time elapsed: 0.644 sec - in org.apache.sling.launchpad.webapp.integrationtest.userManager.RemoveAuthorizablesTest
Running org.apache.sling.launchpad.webapp.integrationtest.userManager.UserPrivilegesInfoTest
Tests run: 7, Failures: 0, Errors: 0, Skipped: 0, Time elapsed: 1.806 sec - in org.apache.sling.launchpad.webapp.integrationtest.userManager.UserPrivilegesInfoTest
Running org.apache.sling.launchpad.webapp.integrationtest.ScriptBuiltinObjectsTest
Tests run: 1, Failures: 0, Errors: 0, Skipped: 0, Time elapsed: 0.159 sec - in org.apache.sling.launchpad.webapp.integrationtest.ScriptBuiltinObjectsTest
Running org.apache.sling.launchpad.webapp.integrationtest.indexing.FullTextIndexingTest
Tests run: 3, Failures: 3, Errors: 0, Skipped: 0, Time elapsed: 45.598 sec <<< FAILURE!
- in org.apache.sling.launchpad.webapp.integrationtest.indexing.FullTextIndexingTest
testUploadedPdfIsIndexed[0 - lorem-ipsum.pdf](org.apache.sling.launchpad.webapp.integrationtest.indexing.FullTextIndexingTest)
 Time elapsed: 15.215 sec  <<< FAILURE!
java.lang.AssertionError: RetryLoop failed, condition is false after 15 seconds: A document
containing 'Excepteur' is found under /tmp/test-FullTextIndexingTest
	at org.junit.Assert.fail(Assert.java:88)
	at org.apache.sling.testing.tools.retry.RetryLoop.<init>(RetryLoop.java:65)
	at org.apache.sling.launchpad.webapp.integrationtest.indexing.FullTextIndexingTest.testUploadedPdfIsIndexed(FullTextIndexingTest.java:97)

testUploadedPdfIsIndexed[1 - another.pdf](org.apache.sling.launchpad.webapp.integrationtest.indexing.FullTextIndexingTest)
 Time elapsed: 15.238 sec  <<< FAILURE!
java.lang.AssertionError: RetryLoop failed, condition is false after 15 seconds: A document
containing 'some text that we will search for' is found under /var/test-FullTextIndexingTest
	at org.junit.Assert.fail(Assert.java:88)
	at org.apache.sling.testing.tools.retry.RetryLoop.<init>(RetryLoop.java:65)
	at org.apache.sling.launchpad.webapp.integrationtest.indexing.FullTextIndexingTest.testUploadedPdfIsIndexed(FullTextIndexingTest.java:97)

testUploadedPdfIsIndexed[2 - french.pdf](org.apache.sling.launchpad.webapp.integrationtest.indexing.FullTextIndexingTest)
 Time elapsed: 15.142 sec  <<< FAILURE!
java.lang.AssertionError: RetryLoop failed, condition is false after 15 seconds: A document
containing 'un autre PDF pour le test fulltext' is found under /libs/test-FullTextIndexingTest
	at org.junit.Assert.fail(Assert.java:88)
	at org.apache.sling.testing.tools.retry.RetryLoop.<init>(RetryLoop.java:65)
	at org.apache.sling.launchpad.webapp.integrationtest.indexing.FullTextIndexingTest.testUploadedPdfIsIndexed(FullTextIndexingTest.java:97)

Running org.apache.sling.launchpad.webapp.integrationtest.PropertyRenderingTest
Tests run: 10, Failures: 0, Errors: 0, Skipped: 0, Time elapsed: 0.447 sec - in org.apache.sling.launchpad.webapp.integrationtest.PropertyRenderingTest
Running org.apache.sling.launchpad.webapp.integrationtest.resourceprovider.PlanetsResourceProviderTest
Tests run: 4, Failures: 0, Errors: 0, Skipped: 0, Time elapsed: 0.054 sec - in org.apache.sling.launchpad.webapp.integrationtest.resourceprovider.PlanetsResourceProviderTest
Running org.apache.sling.launchpad.webapp.integrationtest.WebdavOptionsTest
Tests run: 2, Failures: 0, Errors: 0, Skipped: 0, Time elapsed: 0.027 sec - in org.apache.sling.launchpad.webapp.integrationtest.WebdavOptionsTest
Running org.apache.sling.launchpad.webapp.integrationtest.ResourceResolverProxyTest
Tests run: 1, Failures: 0, Errors: 0, Skipped: 0, Time elapsed: 28.725 sec - in org.apache.sling.launchpad.webapp.integrationtest.ResourceResolverProxyTest
Running org.apache.sling.launchpad.webapp.integrationtest.RedirectTest
Tests run: 6, Failures: 0, Errors: 0, Skipped: 0, Time elapsed: 0.348 sec - in org.apache.sling.launchpad.webapp.integrationtest.RedirectTest
Running org.apache.sling.launchpad.webapp.integrationtest.JspIncludeTest
Tests run: 9, Failures: 0, Errors: 0, Skipped: 0, Time elapsed: 12.548 sec - in org.apache.sling.launchpad.webapp.integrationtest.JspIncludeTest
Running org.apache.sling.launchpad.webapp.integrationtest.jaxb.JaxbMarshallingTest
Tests run: 1, Failures: 1, Errors: 0, Skipped: 0, Time elapsed: 0.041 sec <<< FAILURE!
- in org.apache.sling.launchpad.webapp.integrationtest.jaxb.JaxbMarshallingTest
testJaxbEntityIsMarshalled(org.apache.sling.launchpad.webapp.integrationtest.jaxb.JaxbMarshallingTest)
 Time elapsed: 0.039 sec  <<< FAILURE!
junit.framework.AssertionFailedError: Expected status 200 for http://localhost:8080/bin/jaxb.xml
(content=<!DOCTYPE HTML PUBLIC "-//IETF//DTD HTML 2.0//EN">
<html>
<head>
<title>404 Resource at &apos;/bin/jaxb.xml&apos; not found: No resource found</title>
</head>
<body>
<h1>Resource at &apos;/bin/jaxb.xml&apos; not found: No resource found (404)</h1>
<p>The requested URL /bin/jaxb.xml resulted in an error in org.apache.sling.servlets.resolver.internal.defaults.DefaultErrorHandlerServlet.</p>
<h3>Request Progress:</h3>
<pre>
      0 TIMER_START{Request Processing}
      3 COMMENT timer_end format is {&lt;elapsed microseconds&gt;,&lt;timer name&gt;}
&lt;optional message&gt;
     15 LOG Method=GET, PathInfo=null
     19 TIMER_START{handleSecurity}
   4252 TIMER_END{4231,handleSecurity} authenticator org.apache.sling.auth.core.impl.SlingAuthenticator@1b279b25
returns true
   8363 TIMER_START{ResourceResolution}
   9025 TIMER_END{660,ResourceResolution} URI=/bin/jaxb.xml resolves to Resource=NonExistingResource,
path=/bin/jaxb.xml
   9036 LOG Resource Path Info: SlingRequestPathInfo: path=&apos;/bin/jaxb.xml&apos;,
selectorString=&apos;null&apos;, extension=&apos;xml&apos;, suffix=&apos;null&apos;
   9036 TIMER_START{ServletResolution}
   9041 TIMER_START{resolveServlet(/bin/jaxb.xml)}
  10032 TIMER_END{989,resolveServlet(/bin/jaxb.xml)} Using servlet org.apache.sling.servlets.get.DefaultGetServlet
  10039 TIMER_END{1002,ServletResolution} URI=/bin/jaxb.xml handled by Servlet=org.apache.sling.servlets.get.DefaultGetServlet
  10046 LOG Applying Requestfilters
  10052 LOG Calling filter: org.apache.sling.i18n.impl.I18NFilter
  10058 LOG Calling filter: org.apache.sling.launchpad.testservices.filters.SlingFilter
  10075 LOG Calling filter: org.apache.sling.launchpad.testservices.filters.NoPropertyFilter
  10087 LOG Calling filter: org.apache.sling.engine.impl.debug.RequestProgressTrackerLogFilter
  10092 LOG Applying Componentfilters
  10099 TIMER_START{org.apache.sling.servlets.get.DefaultGetServlet#0}
  10236 TIMER_END{135,org.apache.sling.servlets.get.DefaultGetServlet#0}
  10297 LOG Filter timing: filter=org.apache.sling.engine.impl.debug.RequestProgressTrackerLogFilter,
inner=0, total=0, outer=0
  10307 LOG Filter timing: filter=org.apache.sling.launchpad.testservices.filters.SlingFilterWithPattern,
inner=0, total=0, outer=0
  10316 LOG Filter timing: filter=org.apache.sling.launchpad.testservices.filters.NoPropertyFilter,
inner=0, total=0, outer=0
  10325 LOG Filter timing: filter=org.apache.sling.launchpad.testservices.filters.SlingFilter,
inner=0, total=0, outer=0
  10457 LOG Applying Error filters
  10462 LOG Calling filter: org.apache.sling.i18n.impl.I18NFilter
  10472 TIMER_START{handleError:status=404}
  11099 TIMER_END{625,handleError:status=404} Using handler org.apache.sling.servlets.resolver.internal.defaults.DefaultErrorHandlerServlet
  11675 TIMER_END{11674,Request Processing} Dumping SlingRequestProgressTracker Entries
</pre>
<hr>
<address>ApacheSling/2.6 (jetty/9.3.12.v20160915, Java HotSpot(TM) 64-Bit Server VM
9, Linux 4.4.0-31-generic amd64)</address>
</body>
</html>
) expected:<200> but was:<404>
	at junit.framework.Assert.fail(Assert.java:57)
	at junit.framework.Assert.failNotEquals(Assert.java:329)
	at junit.framework.Assert.assertEquals(Assert.java:78)
	at junit.framework.Assert.assertEquals(Assert.java:234)
	at junit.framework.TestCase.assertEquals(TestCase.java:401)
	at org.apache.sling.commons.testing.integration.HttpTestBase.getContent(HttpTestBase.java:457)
	at org.apache.sling.commons.testing.integration.HttpTestBase.getContent(HttpTestBase.java:432)
	at org.apache.sling.commons.testing.integration.HttpTestBase.getContent(HttpTestBase.java:424)
	at org.apache.sling.commons.testing.integration.HttpTestBase.getContent(HttpTestBase.java:419)
	at org.apache.sling.launchpad.webapp.integrationtest.jaxb.JaxbMarshallingTest.testJaxbEntityIsMarshalled(JaxbMarshallingTest.java:34)

Running org.apache.sling.launchpad.webapp.integrationtest.JsonRenderingTest
Tests run: 17, Failures: 0, Errors: 0, Skipped: 0, Time elapsed: 1.912 sec - in org.apache.sling.launchpad.webapp.integrationtest.JsonRenderingTest
Running org.apache.sling.launchpad.webapp.integrationtest.LaunchpadConfigInstallerTest
Tests run: 1, Failures: 0, Errors: 0, Skipped: 0, Time elapsed: 0.016 sec - in org.apache.sling.launchpad.webapp.integrationtest.LaunchpadConfigInstallerTest
Running org.apache.sling.launchpad.webapp.integrationtest.VanityPathTest
Tests run: 5, Failures: 0, Errors: 0, Skipped: 0, Time elapsed: 0.449 sec - in org.apache.sling.launchpad.webapp.integrationtest.VanityPathTest
Running org.apache.sling.launchpad.webapp.integrationtest.EventsCounterTest
Tests run: 1, Failures: 0, Errors: 0, Skipped: 0, Time elapsed: 0.097 sec - in org.apache.sling.launchpad.webapp.integrationtest.EventsCounterTest
Running org.apache.sling.launchpad.webapp.integrationtest.RequestAttributeTest
Tests run: 1, Failures: 0, Errors: 0, Skipped: 0, Time elapsed: 0.409 sec - in org.apache.sling.launchpad.webapp.integrationtest.RequestAttributeTest
Running org.apache.sling.launchpad.webapp.integrationtest.WebdavUploadTest
Tests run: 4, Failures: 0, Errors: 0, Skipped: 0, Time elapsed: 0.574 sec - in org.apache.sling.launchpad.webapp.integrationtest.WebdavUploadTest
Running org.apache.sling.launchpad.webapp.integrationtest.SlingWebDavServletTest
Tests run: 2, Failures: 0, Errors: 0, Skipped: 0, Time elapsed: 0.286 sec - in org.apache.sling.launchpad.webapp.integrationtest.SlingWebDavServletTest
Running org.apache.sling.launchpad.webapp.integrationtest.SyntheticResourceTest
Tests run: 1, Failures: 0, Errors: 0, Skipped: 0, Time elapsed: 0.108 sec - in org.apache.sling.launchpad.webapp.integrationtest.SyntheticResourceTest
Running org.apache.sling.launchpad.webapp.integrationtest.ServletResolverConfigTest
Tests run: 1, Failures: 0, Errors: 0, Skipped: 0, Time elapsed: 0.013 sec - in org.apache.sling.launchpad.webapp.integrationtest.ServletResolverConfigTest
Running org.apache.sling.launchpad.webapp.integrationtest.repository.RepositoryInitializersTest
Tests run: 1, Failures: 0, Errors: 0, Skipped: 0, Time elapsed: 0.016 sec - in org.apache.sling.launchpad.webapp.integrationtest.repository.RepositoryInitializersTest
Running org.apache.sling.launchpad.webapp.integrationtest.repository.RepositoryNameTest
Tests run: 1, Failures: 0, Errors: 0, Skipped: 0, Time elapsed: 0.051 sec - in org.apache.sling.launchpad.webapp.integrationtest.repository.RepositoryNameTest
Running org.apache.sling.launchpad.webapp.integrationtest.repository.SystemUsersTest
Tests run: 2, Failures: 0, Errors: 0, Skipped: 0, Time elapsed: 0.534 sec - in org.apache.sling.launchpad.webapp.integrationtest.repository.SystemUsersTest
Running org.apache.sling.launchpad.webapp.integrationtest.repository.RepoinitPathTest
Tests run: 1, Failures: 0, Errors: 0, Skipped: 0, Time elapsed: 0.215 sec - in org.apache.sling.launchpad.webapp.integrationtest.repository.RepoinitPathTest
Running org.apache.sling.launchpad.webapp.integrationtest.IncludeTest
Tests run: 5, Failures: 0, Errors: 0, Skipped: 0, Time elapsed: 4.252 sec - in org.apache.sling.launchpad.webapp.integrationtest.IncludeTest
Running org.apache.sling.launchpad.webapp.integrationtest.ForwardTest
Tests run: 5, Failures: 0, Errors: 0, Skipped: 0, Time elapsed: 4.626 sec - in org.apache.sling.launchpad.webapp.integrationtest.ForwardTest
Running org.apache.sling.launchpad.webapp.integrationtest.ExecuteScriptTest
Tests run: 2, Failures: 0, Errors: 0, Skipped: 0, Time elapsed: 0.584 sec - in org.apache.sling.launchpad.webapp.integrationtest.ExecuteScriptTest
Running org.apache.sling.launchpad.webapp.integrationtest.StreamServletTest
Tests run: 4, Failures: 0, Errors: 0, Skipped: 0, Time elapsed: 0.533 sec - in org.apache.sling.launchpad.webapp.integrationtest.StreamServletTest
Running org.apache.sling.launchpad.webapp.integrationtest.ContentLoaderMiscPropertyTest
Tests run: 1, Failures: 0, Errors: 0, Skipped: 0, Time elapsed: 0.014 sec - in org.apache.sling.launchpad.webapp.integrationtest.ContentLoaderMiscPropertyTest

Results :

Failed tests: 
  FullTextIndexingTest.testUploadedPdfIsIndexed:97 RetryLoop failed, condition is false after
15 seconds: A document containing 'Excepteur' is found under /tmp/test-FullTextIndexingTest
  FullTextIndexingTest.testUploadedPdfIsIndexed:97 RetryLoop failed, condition is false after
15 seconds: A document containing 'some text that we will search for' is found under /var/test-FullTextIndexingTest
  FullTextIndexingTest.testUploadedPdfIsIndexed:97 RetryLoop failed, condition is false after
15 seconds: A document containing 'un autre PDF pour le test fulltext' is found under /libs/test-FullTextIndexingTest
  JaxbMarshallingTest.testJaxbEntityIsMarshalled:34->HttpTestBase.getContent:419->HttpTestBase.getContent:424->HttpTestBase.getContent:432->HttpTestBase.getContent:457
Expected status 200 for http://localhost:8080/bin/jaxb.xml (content=<!DOCTYPE HTML PUBLIC
"-//IETF//DTD HTML 2.0//EN">
<html>
<head>
<title>404 Resource at &apos;/bin/jaxb.xml&apos; not found: No resource found</title>
</head>
<body>
<h1>Resource at &apos;/bin/jaxb.xml&apos; not found: No resource found (404)</h1>
<p>The requested URL /bin/jaxb.xml resulted in an error in org.apache.sling.servlets.resolver.internal.defaults.DefaultErrorHandlerServlet.</p>
<h3>Request Progress:</h3>
<pre>
      0 TIMER_START{Request Processing}
      3 COMMENT timer_end format is {&lt;elapsed microseconds&gt;,&lt;timer name&gt;}
&lt;optional message&gt;
     15 LOG Method=GET, PathInfo=null
     19 TIMER_START{handleSecurity}
   4252 TIMER_END{4231,handleSecurity} authenticator org.apache.sling.auth.core.impl.SlingAuthenticator@1b279b25
returns true
   8363 TIMER_START{ResourceResolution}
   9025 TIMER_END{660,ResourceResolution} URI=/bin/jaxb.xml resolves to Resource=NonExistingResource,
path=/bin/jaxb.xml
   9036 LOG Resource Path Info: SlingRequestPathInfo: path=&apos;/bin/jaxb.xml&apos;,
selectorString=&apos;null&apos;, extension=&apos;xml&apos;, suffix=&apos;null&apos;
   9036 TIMER_START{ServletResolution}
   9041 TIMER_START{resolveServlet(/bin/jaxb.xml)}
  10032 TIMER_END{989,resolveServlet(/bin/jaxb.xml)} Using servlet org.apache.sling.servlets.get.DefaultGetServlet
  10039 TIMER_END{1002,ServletResolution} URI=/bin/jaxb.xml handled by Servlet=org.apache.sling.servlets.get.DefaultGetServlet
  10046 LOG Applying Requestfilters
  10052 LOG Calling filter: org.apache.sling.i18n.impl.I18NFilter
  10058 LOG Calling filter: org.apache.sling.launchpad.testservices.filters.SlingFilter
  10075 LOG Calling filter: org.apache.sling.launchpad.testservices.filters.NoPropertyFilter
  10087 LOG Calling filter: org.apache.sling.engine.impl.debug.RequestProgressTrackerLogFilter
  10092 LOG Applying Componentfilters
  10099 TIMER_START{org.apache.sling.servlets.get.DefaultGetServlet#0}
  10236 TIMER_END{135,org.apache.sling.servlets.get.DefaultGetServlet#0}
  10297 LOG Filter timing: filter=org.apache.sling.engine.impl.debug.RequestProgressTrackerLogFilter,
inner=0, total=0, outer=0
  10307 LOG Filter timing: filter=org.apache.sling.launchpad.testservices.filters.SlingFilterWithPattern,
inner=0, total=0, outer=0
  10316 LOG Filter timing: filter=org.apache.sling.launchpad.testservices.filters.NoPropertyFilter,
inner=0, total=0, outer=0
  10325 LOG Filter timing: filter=org.apache.sling.launchpad.testservices.filters.SlingFilter,
inner=0, total=0, outer=0
  10457 LOG Applying Error filters
  10462 LOG Calling filter: org.apache.sling.i18n.impl.I18NFilter
  10472 TIMER_START{handleError:status=404}
  11099 TIMER_END{625,handleError:status=404} Using handler org.apache.sling.servlets.resolver.internal.defaults.DefaultErrorHandlerServlet
  11675 TIMER_END{11674,Request Processing} Dumping SlingRequestProgressTracker Entries
</pre>
<hr>
<address>ApacheSling/2.6 (jetty/9.3.12.v20160915, Java HotSpot(TM) 64-Bit Server VM
9, Linux 4.4.0-31-generic amd64)</address>
</body>
</html>
) expected:<200> but was:<404>

Tests run: 564, Failures: 4, Errors: 0, Skipped: 1

[JENKINS] Recording test results
[INFO] 
[INFO] --- jetty-maven-plugin:9.3.12.v20160915:stop (stop-jetty) @ org.apache.sling.launchpad.testing-war
---
[INFO] Stopped ServerConnector@5ba908f2{HTTP/1.1,[http/1.1]}{0.0.0.0:8080}
[INFO] 
[INFO] --- ianal-maven-plugin:1.0-alpha-1:verify-legal-files (default) @ org.apache.sling.launchpad.testing-war
---
[INFO] Checking legal files in: org.apache.sling.launchpad.testing-war-10-SNAPSHOT.jar
[INFO] Checking legal files in: org.apache.sling.launchpad.testing-war-10-SNAPSHOT.war
[INFO] Checking legal files in: org.apache.sling.launchpad.testing-war-10-SNAPSHOT-sources.jar
[INFO] 
[INFO] --- maven-failsafe-plugin:2.18.1:verify (default) @ org.apache.sling.launchpad.testing-war
---
[INFO] Failsafe report directory: <https://builds.apache.org/job/sling-org-apache-sling-launchpad-testing-war-9/ws/target/failsafe-reports>
[ERROR] There are test failures.

Please refer to <https://builds.apache.org/job/sling-org-apache-sling-launchpad-testing-war-9/ws/target/failsafe-reports>
for the individual test results.
[JENKINS] Recording test results
[INFO] 
[INFO] --- apache-rat-plugin:0.11:check (default) @ org.apache.sling.launchpad.testing-war
---
[INFO] 51 implicit excludes (use -debug for more details).
[INFO] Exclude: DEPENDENCIES
[INFO] Exclude: src/main/appended-resources/META-INF/*
[INFO] Exclude: velocity.log
[INFO] Exclude: target/*
[INFO] Exclude: README.md
[INFO] Exclude: maven-eclipse.xml
[INFO] Exclude: .*
[INFO] Exclude: .*/**
[INFO] Exclude: **/*.json
[INFO] Exclude: DEPENDENCIES
[INFO] Exclude: **/*.rej
[INFO] Exclude: hs_err_*.log
[INFO] Exclude: **/repository/index/*/index-details.txt
[INFO] Exclude: sling/**
[INFO] 4 resources included (use -debug for more details)
[INFO] Rat check: Summary of files. Unapproved: 0 unknown: 0 generated: 0 approved: 3 licence.
[JENKINS] Archiving disabled
[JENKINS] Archiving disabled[INFO] ------------------------------------------------------------------------
[INFO] BUILD SUCCESS
[INFO] ------------------------------------------------------------------------
[INFO] Total time: 07:09 min
[INFO] Finished at: 2017-11-09T13:15:32+00:00

[INFO] Final Memory: 152M/508M
[INFO] ------------------------------------------------------------------------
Waiting for Jenkins to finish collecting data
channel stopped
Recording test results

Mime
View raw message