sling-commits mailing list archives

Site index · List index
Message view « Date » · « Thread »
Top « Date » · « Thread »
From Apache Jenkins Server <jenk...@builds.apache.org>
Subject Build failed in Jenkins: sling-org-apache-sling-scripting-sightly-1.8 #9
Date Tue, 21 Nov 2017 16:22:39 GMT
See <https://builds.apache.org/job/sling-org-apache-sling-scripting-sightly-1.8/9/display/redirect?page=changes>

Changes:

[cotescu] [maven-release-plugin] prepare release

[cotescu] [maven-release-plugin] prepare for next development iteration

------------------------------------------
Started by an SCM change
[EnvInject] - Loading node environment variables.
Building remotely on H25 (ubuntu xenial) in workspace <https://builds.apache.org/job/sling-org-apache-sling-scripting-sightly-1.8/ws/>
 > git rev-parse --is-inside-work-tree # timeout=10
Fetching changes from the remote Git repository
 > git config remote.origin.url https://github.com/apache/sling-org-apache-sling-scripting-sightly.git
# timeout=10
Fetching upstream changes from https://github.com/apache/sling-org-apache-sling-scripting-sightly.git
 > git --version # timeout=10
 > git fetch --tags --progress https://github.com/apache/sling-org-apache-sling-scripting-sightly.git
+refs/heads/*:refs/remotes/origin/*
 > git rev-parse origin/master^{commit} # timeout=10
Checking out Revision bb9f683bd91ae23d1969fa1c9f366fa8ed893477 (origin/master)
 > git config core.sparsecheckout # timeout=10
 > git checkout -f bb9f683bd91ae23d1969fa1c9f366fa8ed893477
Commit message: "[maven-release-plugin] prepare for next development iteration"
 > git rev-list e676f97d2858f93854d617d1a4e496e6882af279 # timeout=10
Parsing POMs
Modules changed, recalculating dependency graph
Established TCP socket on 33899
maven33-agent.jar already up to date
maven33-interceptor.jar already up to date
maven3-interceptor-commons.jar already up to date
[sling-org-apache-sling-scripting-sightly-1.8] $ /home/jenkins/tools/java/latest1.8/bin/java
-Xmx2g -Xms256m -cp /home/jenkins/jenkins-slave/maven33-agent.jar:/home/jenkins/tools/maven/apache-maven-3.3.9/boot/plexus-classworlds-2.5.2.jar:/home/jenkins/tools/maven/apache-maven-3.3.9/conf/logging
jenkins.maven3.agent.Maven33Main /home/jenkins/tools/maven/apache-maven-3.3.9 /home/jenkins/jenkins-slave/slave.jar
/home/jenkins/jenkins-slave/maven33-interceptor.jar /home/jenkins/jenkins-slave/maven3-interceptor-commons.jar
33899
<===[JENKINS REMOTING CAPACITY]===>   channel started
Executing Maven:  -B -f <https://builds.apache.org/job/sling-org-apache-sling-scripting-sightly-1.8/ws/pom.xml>
-Dmaven.repo.local=/home/jenkins/jenkins-slave/maven-repositories/1 -U clean deploy
[INFO] Scanning for projects...
[INFO]                                                                         
[INFO] ------------------------------------------------------------------------
[INFO] Building Apache Sling Scripting HTL Engine 1.0.45-SNAPSHOT
[INFO] ------------------------------------------------------------------------
[INFO] Downloading: http://repository.apache.org/snapshots/org/apache/sling/org.apache.sling.scripting.sightly.compiler.java/1.0.17-SNAPSHOT/maven-metadata.xml
[INFO] Downloading: http://repository.apache.org/snapshots/org/apache/sling/org.apache.sling.scripting.sightly.compiler.java/1.0.17-SNAPSHOT/org.apache.sling.scripting.sightly.compiler.java-1.0.17-SNAPSHOT.pom
[WARNING] The POM for org.apache.sling:org.apache.sling.scripting.sightly.compiler.java:jar:1.0.17-SNAPSHOT
is missing, no dependency information available
[INFO] Downloading: http://repository.apache.org/snapshots/org/apache/sling/org.apache.sling.scripting.sightly.compiler.java/1.0.17-SNAPSHOT/org.apache.sling.scripting.sightly.compiler.java-1.0.17-SNAPSHOT.jar
[JENKINS] Archiving disabled
[JENKINS] Archiving disabled
[INFO] ------------------------------------------------------------------------
[INFO] BUILD FAILURE
[INFO] ------------------------------------------------------------------------
[INFO] Total time: 8.343 s
[INFO] Finished at: 2017-11-21T16:22:36+00:00
[INFO] Final Memory: 20M/300M
[INFO] ------------------------------------------------------------------------
Waiting for Jenkins to finish collecting data
[ERROR] Failed to execute goal on project org.apache.sling.scripting.sightly: Could not resolve
dependencies for project org.apache.sling:org.apache.sling.scripting.sightly:bundle:1.0.45-SNAPSHOT:
Could not find artifact org.apache.sling:org.apache.sling.scripting.sightly.compiler.java:jar:1.0.17-SNAPSHOT
in Nexus (http://repository.apache.org/snapshots) -> [Help 1]
[ERROR] 
[ERROR] To see the full stack trace of the errors, re-run Maven with the -e switch.
[ERROR] Re-run Maven using the -X switch to enable full debug logging.
[ERROR] 
[ERROR] For more information about the errors and possible solutions, please read the following
articles:
[ERROR] [Help 1] http://cwiki.apache.org/confluence/display/MAVEN/DependencyResolutionException
channel stopped
Recording test results
ERROR: Step ?Publish JUnit test result report? failed: Test reports were found but none of
them are new. Did tests run? 
For example, <https://builds.apache.org/job/sling-org-apache-sling-scripting-sightly-1.8/ws/target/surefire-reports/TEST-org.apache.sling.scripting.sightly.impl.compiler.SightlyJavaCompilerServiceTest.xml>
is 2 days 5 hr old

Not sending mail to unregistered user cotescu@adobe.com

Mime
View raw message