sling-commits mailing list archives

Site index · List index
Message view « Date » · « Thread »
Top « Date » · « Thread »
From Apache Jenkins Server <jenk...@builds.apache.org>
Subject Build failed in Jenkins: sling-bundles-extensions-models-integration-tests-1.8 #52
Date Thu, 01 Jun 2017 21:43:01 GMT
See <https://builds.apache.org/job/sling-bundles-extensions-models-integration-tests-1.8/52/display/redirect?page=changes>

Changes:

[pauls] SLING-6912: Remove commons.json from bundles/extensions/models/integration-tests

------------------------------------------
[...truncated 8.31 KB...]
[INFO] 
[INFO] --- maven-dependency-plugin:2.10:copy-dependencies (copy-runnable-jar) @ org.apache.sling.models.integration-tests
---
[INFO] Copying org.apache.sling.launchpad-7-standalone.jar to <https://builds.apache.org/job/sling-bundles-extensions-models-integration-tests-1.8/ws/target/dependency/org.apache.sling.launchpad-7-standalone.jar>
[INFO] 
[INFO] --- maven-dependency-plugin:2.10:copy-dependencies (copy-additional-bundles) @ org.apache.sling.models.integration-tests
---
[INFO] Copying org.osgi.compendium-4.1.0.jar to <https://builds.apache.org/job/sling-bundles-extensions-models-integration-tests-1.8/ws/target/sling/additional-bundles/org.osgi.compendium-4.1.0.jar>
[INFO] Copying commons-io-1.4.jar to <https://builds.apache.org/job/sling-bundles-extensions-models-integration-tests-1.8/ws/target/sling/additional-bundles/commons-io-1.4.jar>
[INFO] Copying slf4j-simple-1.5.2.jar to <https://builds.apache.org/job/sling-bundles-extensions-models-integration-tests-1.8/ws/target/sling/additional-bundles/slf4j-simple-1.5.2.jar>
[INFO] Copying org.apache.felix.scr.annotations-1.9.12.jar to <https://builds.apache.org/job/sling-bundles-extensions-models-integration-tests-1.8/ws/target/sling/additional-bundles/org.apache.felix.scr.annotations-1.9.12.jar>
[INFO] Copying httpcore-osgi-4.1.2.jar to <https://builds.apache.org/job/sling-bundles-extensions-models-integration-tests-1.8/ws/target/sling/additional-bundles/httpcore-osgi-4.1.2.jar>
[INFO] Copying org.osgi.core-4.1.0.jar to <https://builds.apache.org/job/sling-bundles-extensions-models-integration-tests-1.8/ws/target/sling/additional-bundles/org.osgi.core-4.1.0.jar>
[INFO] Copying geronimo-atinject_1.0_spec-1.0.jar to <https://builds.apache.org/job/sling-bundles-extensions-models-integration-tests-1.8/ws/target/sling/additional-bundles/geronimo-atinject_1.0_spec-1.0.jar>
[INFO] Copying org.apache.sling.api-2.4.0.jar to <https://builds.apache.org/job/sling-bundles-extensions-models-integration-tests-1.8/ws/target/sling/additional-bundles/org.apache.sling.api-2.4.0.jar>
[INFO] Copying bndlib-1.50.0.jar to <https://builds.apache.org/job/sling-bundles-extensions-models-integration-tests-1.8/ws/target/sling/additional-bundles/bndlib-1.50.0.jar>
[INFO] Copying servlet-api-2.4.jar to <https://builds.apache.org/job/sling-bundles-extensions-models-integration-tests-1.8/ws/target/sling/additional-bundles/servlet-api-2.4.jar>
[INFO] Copying jcr-1.0.jar to <https://builds.apache.org/job/sling-bundles-extensions-models-integration-tests-1.8/ws/target/sling/additional-bundles/jcr-1.0.jar>
[INFO] Copying org.apache.sling.launchpad-7-standalone.jar to <https://builds.apache.org/job/sling-bundles-extensions-models-integration-tests-1.8/ws/target/sling/additional-bundles/org.apache.sling.launchpad-7-standalone.jar>
[INFO] Copying org.apache.sling.engine-2.2.0.jar to <https://builds.apache.org/job/sling-bundles-extensions-models-integration-tests-1.8/ws/target/sling/additional-bundles/org.apache.sling.engine-2.2.0.jar>
[INFO] Copying org.apache.sling.models.api-1.3.5-SNAPSHOT.jar to <https://builds.apache.org/job/sling-bundles-extensions-models-integration-tests-1.8/ws/target/sling/additional-bundles/org.apache.sling.models.api-1.3.5-SNAPSHOT.jar>
[INFO] Copying org.apache.sling.models.jacksonexporter-1.0.7-SNAPSHOT.jar to <https://builds.apache.org/job/sling-bundles-extensions-models-integration-tests-1.8/ws/target/sling/additional-bundles/org.apache.sling.models.jacksonexporter-1.0.7-SNAPSHOT.jar>
[INFO] Copying slf4j-api-1.5.2.jar to <https://builds.apache.org/job/sling-bundles-extensions-models-integration-tests-1.8/ws/target/sling/additional-bundles/slf4j-api-1.5.2.jar>
[INFO] Copying jackson-databind-2.3.2.jar to <https://builds.apache.org/job/sling-bundles-extensions-models-integration-tests-1.8/ws/target/sling/additional-bundles/jackson-databind-2.3.2.jar>
[INFO] Copying org.apache.sling.commons.johnzon-1.0.0.jar to <https://builds.apache.org/job/sling-bundles-extensions-models-integration-tests-1.8/ws/target/sling/additional-bundles/org.apache.sling.commons.johnzon-1.0.0.jar>
[INFO] Copying org.apache.sling.models.impl-1.4.3-SNAPSHOT.jar to <https://builds.apache.org/job/sling-bundles-extensions-models-integration-tests-1.8/ws/target/sling/additional-bundles/org.apache.sling.models.impl-1.4.3-SNAPSHOT.jar>
[INFO] Copying commons-lang-2.5.jar to <https://builds.apache.org/job/sling-bundles-extensions-models-integration-tests-1.8/ws/target/sling/additional-bundles/commons-lang-2.5.jar>
[INFO] Copying org.apache.sling.junit.remote-1.0.11-SNAPSHOT.jar to <https://builds.apache.org/job/sling-bundles-extensions-models-integration-tests-1.8/ws/target/sling/additional-bundles/org.apache.sling.junit.remote-1.0.11-SNAPSHOT.jar>
[INFO] Copying junit-4.12.jar to <https://builds.apache.org/job/sling-bundles-extensions-models-integration-tests-1.8/ws/target/sling/additional-bundles/junit-4.12.jar>
[INFO] Copying jackson-core-2.3.2.jar to <https://builds.apache.org/job/sling-bundles-extensions-models-integration-tests-1.8/ws/target/sling/additional-bundles/jackson-core-2.3.2.jar>
[INFO] Copying httpclient-osgi-4.1.2.jar to <https://builds.apache.org/job/sling-bundles-extensions-models-integration-tests-1.8/ws/target/sling/additional-bundles/httpclient-osgi-4.1.2.jar>
[INFO] Copying org.apache.sling.testing.tools-1.0.17-SNAPSHOT.jar to <https://builds.apache.org/job/sling-bundles-extensions-models-integration-tests-1.8/ws/target/sling/additional-bundles/org.apache.sling.testing.tools-1.0.17-SNAPSHOT.jar>
[INFO] Copying jackson-annotations-2.3.2.jar to <https://builds.apache.org/job/sling-bundles-extensions-models-integration-tests-1.8/ws/target/sling/additional-bundles/jackson-annotations-2.3.2.jar>
[INFO] 
[INFO] --- build-helper-maven-plugin:1.9.1:reserve-network-port (reserve-server-port) @ org.apache.sling.models.integration-tests
---
[INFO] Reserved port 41338 for http.port
[INFO] 
[INFO] --- maven-compiler-plugin:3.2:compile (default-compile) @ org.apache.sling.models.integration-tests
---
[INFO] Changes detected - recompiling the module!
[INFO] Compiling 55 source files to <https://builds.apache.org/job/sling-bundles-extensions-models-integration-tests-1.8/ws/target/classes>
[INFO] <https://builds.apache.org/job/sling-bundles-extensions-models-integration-tests-1.8/ws/src/main/java/org/apache/sling/models/it/exporter/ExporterTest.java>:
Some input files use or override a deprecated API.
[INFO] <https://builds.apache.org/job/sling-bundles-extensions-models-integration-tests-1.8/ws/src/main/java/org/apache/sling/models/it/exporter/ExporterTest.java>:
Recompile with -Xlint:deprecation for details.
[INFO] <https://builds.apache.org/job/sling-bundles-extensions-models-integration-tests-1.8/ws/src/main/java/org/apache/sling/models/it/exporter/ExporterTest.java>:
<https://builds.apache.org/job/sling-bundles-extensions-models-integration-tests-1.8/ws/src/main/java/org/apache/sling/models/it/exporter/ExporterTest.java>
uses unchecked or unsafe operations.
[INFO] <https://builds.apache.org/job/sling-bundles-extensions-models-integration-tests-1.8/ws/src/main/java/org/apache/sling/models/it/exporter/ExporterTest.java>:
Recompile with -Xlint:unchecked for details.
[INFO] 
[INFO] --- maven-scr-plugin:1.21.0:scr (generate-scr-scrdescriptor) @ org.apache.sling.models.integration-tests
---
[INFO] Writing 1 Service Component Descriptors to <https://builds.apache.org/job/sling-bundles-extensions-models-integration-tests-1.8/ws/target/classes/OSGI-INF/org.apache.sling.models.it.services.AnotherTestBindingsValuesProvider.xml>
[INFO] Writing 1 Service Component Descriptors to <https://builds.apache.org/job/sling-bundles-extensions-models-integration-tests-1.8/ws/target/classes/OSGI-INF/org.apache.sling.models.it.services.TestBindingsValuesProvider.xml>
[INFO] Writing 1 Service Component Descriptors to <https://builds.apache.org/job/sling-bundles-extensions-models-integration-tests-1.8/ws/target/classes/OSGI-INF/org.apache.sling.models.it.implpicker.CustomLastImplementationPicker.xml>
[INFO] 
[INFO] --- maven-resources-plugin:2.7:testResources (default-testResources) @ org.apache.sling.models.integration-tests
---
[INFO] Using 'UTF-8' encoding to copy filtered resources.
[INFO] skip non existing resourceDirectory <https://builds.apache.org/job/sling-bundles-extensions-models-integration-tests-1.8/ws/src/test/resources>
[INFO] Copying 3 resources
[INFO] 
[INFO] --- maven-compiler-plugin:3.2:testCompile (default-testCompile) @ org.apache.sling.models.integration-tests
---
[INFO] Changes detected - recompiling the module!
[INFO] Compiling 1 source file to <https://builds.apache.org/job/sling-bundles-extensions-models-integration-tests-1.8/ws/target/test-classes>
[INFO] 
[INFO] --- maven-surefire-plugin:2.18.1:test (default-test) @ org.apache.sling.models.integration-tests
---
[JENKINS] Recording test results[INFO] 
[INFO] --- animal-sniffer-maven-plugin:1.14:check (default) @ org.apache.sling.models.integration-tests
---

[INFO] Checking unresolved references to org.codehaus.mojo.signature:java17:1.0
[INFO] 
[INFO] --- maven-bundle-plugin:3.0.1:bundle (default-bundle) @ org.apache.sling.models.integration-tests
---
[INFO] 
[INFO] >>> maven-source-plugin:2.4:jar (attach-sources) > generate-sources @ org.apache.sling.models.integration-tests
>>>
[INFO] 
[INFO] --- maven-enforcer-plugin:1.3.1:enforce (enforce-java) @ org.apache.sling.models.integration-tests
---
[INFO] 
[INFO] --- maven-antrun-plugin:1.8:run (set-bundle-required-execution-environment) @ org.apache.sling.models.integration-tests
---
[INFO] Executing tasks

main:
Setting Bundle-RequiredExecutionEnvironment=JavaSE-1.7 from sling.java.version=7
[INFO] Executed tasks
[WARNING] Failed to getClass for org.apache.maven.plugin.source.SourceJarMojo
[INFO] 
[INFO] <<< maven-source-plugin:2.4:jar (attach-sources) < generate-sources @ org.apache.sling.models.integration-tests
<<<
[INFO] 
[INFO] --- maven-source-plugin:2.4:jar (attach-sources) @ org.apache.sling.models.integration-tests
---
[INFO] Building jar: <https://builds.apache.org/job/sling-bundles-extensions-models-integration-tests-1.8/ws/target/org.apache.sling.models.integration-tests-0.0.1-SNAPSHOT-sources.jar>
[INFO] 
[INFO] --- maven-site-plugin:3.4:attach-descriptor (attach-descriptor) @ org.apache.sling.models.integration-tests
---
[INFO] 
[INFO] --- maven-failsafe-plugin:2.18.1:integration-test (integration-test) @ org.apache.sling.models.integration-tests
---
[INFO] Failsafe report directory: <https://builds.apache.org/job/sling-bundles-extensions-models-integration-tests-1.8/ws/target/failsafe-reports>

-------------------------------------------------------
 T E S T S
-------------------------------------------------------
92 [main] INFO org.apache.sling.models.it.RemoteIT - Server base URL=http://localhost:41338
105 [main] INFO org.apache.sling.testing.tools.jarexec.JarExecutor - Executable jar options:
-p 41338
105 [main] INFO org.apache.sling.testing.tools.jarexec.JarExecutor - Executing asynchronously:
/usr/local/asfpackages/java/jdk1.8.0_121/jre/bin/java -Xmx512m -jar <https://builds.apache.org/job/sling-bundles-extensions-models-integration-tests-1.8/ws/target/dependency/org.apache.sling.launchpad-7-standalone.jar>
-p 41338
106 [main] INFO org.apache.sling.testing.tools.jarexec.JarExecutor - Setting up ProcessDestroyer
with waitOnShutdown=false
110 [main] INFO org.apache.sling.testing.tools.sling.TimeoutsProvider - Timeout factor set
to 1.0 from system property sling.testing.timeout.multiplier
111 [main] INFO org.apache.sling.models.it.RemoteIT - Will wait up to 60 seconds for server
to become ready
115 [main] INFO org.apache.sling.models.it.RemoteIT - Checking that GET requests return expected
content (timeout=60 seconds): [/:script src="system/sling.js", /.explorer.html:href="/libs/sling/explorer/css/explorer.css",
/sling-test/sling/sling-test.html:Sling client library tests]
01.06.2017 21:41:45.652 *INFO * [main] Setting sling.home=sling (default)
01.06.2017 21:41:45.654 *INFO * [main] Starting Apache Sling in <https://builds.apache.org/job/sling-bundles-extensions-models-integration-tests-1.8/ws/sling>
01.06.2017 21:41:45.658 *INFO * [main] Sling  Extension Lib Home : <https://builds.apache.org/job/sling-bundles-extensions-models-integration-tests-1.8/ws/sling/ext>
01.06.2017 21:41:45.660 *INFO * [main] Checking launcher JAR in folder <https://builds.apache.org/job/sling-bundles-extensions-models-integration-tests-1.8/ws/sling>
01.06.2017 21:41:45.674 *INFO * [main] Installing new launcher: jar:<https://builds.apache.org/job/sling-bundles-extensions-models-integration-tests-1.8/ws/target/dependency/org.apache.sling.launchpad-7-standalone.jar!/resources/org.apache.sling.launchpad.base.jar,>
4.4.1.2_5_2 (org.apache.sling.launchpad.base.jar.1496353305674)
01.06.2017 21:41:45.680 *INFO * [main] Loading launcher class org.apache.sling.launchpad.base.app.MainDelegate
from org.apache.sling.launchpad.base.jar.1496353305674
01.06.2017 21:41:45.682 *INFO * [main] External Libs Home (ext) is null or does not exists.
01.06.2017 21:41:45.709 *INFO * [main] Setting sling.launchpad=<https://builds.apache.org/job/sling-bundles-extensions-models-integration-tests-1.8/ws/sling>
01.06.2017 21:41:45.709 *INFO * [main] Setting org.osgi.service.http.port=41338
01.06.2017 21:41:45.710 *INFO * [main] Starting launcher ...
01.06.2017 21:41:45.711 *INFO * [main] HTTP server port: 41338
01.06.2017 21:41:46.373 *INFO* [FelixStartLevel] org.apache.sling.settings.impl.SlingSettingsServiceImpl
Active run modes: [jackrabbit]
01.06.2017 21:41:46.405 *INFO* [FelixStartLevel] org.apache.sling.commons.logservice Service
[org.apache.sling.commons.logservice.internal.LogServiceFactory,13] ServiceEvent REGISTERED
01.06.2017 21:41:46.407 *INFO* [FelixStartLevel] org.apache.sling.commons.logservice Service
[org.apache.sling.commons.logservice.internal.LogReaderServiceFactory,14] ServiceEvent REGISTERED
01.06.2017 21:41:46.407 *INFO* [FelixStartLevel] org.apache.sling.commons.logservice BundleEvent
STARTED
01.06.2017 21:41:46.410 *INFO* [FelixStartLevel] log4j.over.slf4j BundleEvent RESOLVED
01.06.2017 21:41:46.410 *INFO* [FelixStartLevel] log4j.over.slf4j BundleEvent STARTING
01.06.2017 21:41:46.411 *INFO* [FelixStartLevel] log4j.over.slf4j BundleEvent STARTED
01.06.2017 21:41:46.412 *INFO* [FelixStartLevel] org.apache.sling.commons.log BundleEvent
STARTING
01.06.2017 21:41:46.434 *INFO* [FelixStartLevel] org.apache.sling.commons.log Service [org.apache.sling.commons.log.LogManager,15]
ServiceEvent REGISTERED
01.06.2017 21:41:46.434 *INFO* [FelixStartLevel] org.apache.sling.commons.log Service [org.apache.sling.commons.log.LogManager.factory.writer,16]
ServiceEvent REGISTERED
01.06.2017 21:41:46.435 *INFO* [FelixStartLevel] org.apache.sling.commons.log Service [org.apache.sling.commons.log.LogManager.factory.config,17]
ServiceEvent REGISTERED
01.06.2017 21:41:46.437 *INFO* [FelixStartLevel] org.apache.sling.commons.log Service [Sling
Log Support,18] ServiceEvent REGISTERED
01.06.2017 21:41:46.438 *INFO* [FelixStartLevel] org.apache.sling.commons.log Service [Sling
Log Configuration Printer,19] ServiceEvent REGISTERED
01.06.2017 21:41:46.444 *INFO* [FelixStartLevel] org.apache.sling.commons.log Service [Sling
Log Reset Event Handler,20] ServiceEvent REGISTERED
01.06.2017 21:41:46.446 *INFO* [FelixStartLevel] org.apache.sling.commons.log.logback.internal.Activator
LogbackManager initialized at bundle startup
01.06.2017 21:41:46.446 *INFO* [FelixStartLevel] org.apache.sling.commons.log BundleEvent
STARTED
01.06.2017 21:41:46.449 *INFO* [FelixStartLevel] org.apache.sling.launchpad.installer BundleEvent
RESOLVED
01.06.2017 21:41:46.450 *INFO* [FelixStartLevel] org.apache.sling.launchpad.installer BundleEvent
STARTING
01.06.2017 21:41:46.452 *INFO* [FelixStartLevel] org.apache.sling.launchpad.installer BundleEvent
STARTED
01.06.2017 21:41:46.458 *INFO* [FelixStartLevel] org.apache.felix.configadmin BundleEvent
STARTING
01.06.2017 21:41:46.470 *INFO* [FelixStartLevel] org.apache.felix.configadmin Service [org.apache.felix.cm.file.FilePersistenceManager,21]
ServiceEvent REGISTERED
01.06.2017 21:41:46.471 *INFO* [FelixStartLevel] org.apache.felix.configadmin Service [org.apache.felix.cm.ConfigurationAdmin,22]
ServiceEvent REGISTERED
01.06.2017 21:41:46.480 *INFO* [FelixStartLevel] org.apache.felix.configadmin BundleEvent
STARTED
01.06.2017 21:41:46.480 *INFO* [FelixStartLevel] org.apache.sling.installer.core BundleEvent
STARTING
01.06.2017 21:41:46.655 *INFO * [main] Startup completed
11085 [main] INFO org.apache.sling.models.it.RemoteIT - All 3 paths return expected content,
server ready
12188 [main] INFO org.apache.sling.testing.tools.osgi.WebconsoleClient - Installing bundle
org.apache.sling.models.integration-tests-0.0.1-SNAPSHOT.jar at default start level
12227 [main] INFO org.apache.sling.testing.tools.sling.BundlesInstaller - Installed: org.apache.sling.models.integration-tests
12257 [main] INFO org.apache.sling.testing.tools.sling.BundlesInstaller - Reinstalling (due
to SNAPSHOT version): org.apache.sling.models.api
12307 [main] INFO org.apache.sling.testing.tools.osgi.WebconsoleClient - Uninstalling bundle
org.apache.sling.models.api with bundleId 94
13121 [main] INFO org.apache.sling.testing.tools.osgi.WebconsoleClient - Installing bundle
org.apache.sling.models.api-1.3.5-SNAPSHOT.jar at default start level
13140 [main] INFO org.apache.sling.testing.tools.sling.BundlesInstaller - Installed: org.apache.sling.models.api
13159 [main] INFO org.apache.sling.testing.tools.sling.BundlesInstaller - Reinstalling (due
to SNAPSHOT version): org.apache.sling.models.impl
13176 [main] INFO org.apache.sling.testing.tools.osgi.WebconsoleClient - Uninstalling bundle
org.apache.sling.models.impl with bundleId 95
14022 [main] INFO org.apache.sling.testing.tools.osgi.WebconsoleClient - Installing bundle
org.apache.sling.models.impl-1.4.3-SNAPSHOT.jar at default start level
14042 [main] INFO org.apache.sling.testing.tools.sling.BundlesInstaller - Installed: org.apache.sling.models.impl
15057 [main] INFO org.apache.sling.testing.tools.osgi.WebconsoleClient - Installing bundle
org.apache.sling.models.jacksonexporter-1.0.7-SNAPSHOT.jar at default start level
15071 [main] INFO org.apache.sling.testing.tools.sling.BundlesInstaller - Installed: org.apache.sling.models.jacksonexporter
16104 [main] INFO org.apache.sling.testing.tools.osgi.WebconsoleClient - Installing bundle
jackson-annotations-2.3.2.jar at default start level
16115 [main] INFO org.apache.sling.testing.tools.sling.BundlesInstaller - Installed: com.fasterxml.jackson.core.jackson-annotations
17130 [main] INFO org.apache.sling.testing.tools.osgi.WebconsoleClient - Installing bundle
jackson-core-2.3.2.jar at default start level
17143 [main] INFO org.apache.sling.testing.tools.sling.BundlesInstaller - Installed: com.fasterxml.jackson.core.jackson-core
18160 [main] INFO org.apache.sling.testing.tools.osgi.WebconsoleClient - Installing bundle
jackson-databind-2.3.2.jar at default start level
18177 [main] INFO org.apache.sling.testing.tools.sling.BundlesInstaller - Installed: com.fasterxml.jackson.core.jackson-databind
19194 [main] INFO org.apache.sling.testing.tools.osgi.WebconsoleClient - Installing bundle
geronimo-atinject_1.0_spec-1.0.jar at default start level
19204 [main] INFO org.apache.sling.testing.tools.sling.BundlesInstaller - Installed: org.apache.geronimo.specs.geronimo-atinject_1.0_spec
20218 [main] INFO org.apache.sling.testing.tools.osgi.WebconsoleClient - Installing bundle
org.apache.sling.commons.johnzon-1.0.0.jar at default start level
20228 [main] INFO org.apache.sling.testing.tools.sling.BundlesInstaller - Installed: org.apache.sling.commons.johnzon
20228 [main] INFO org.apache.sling.testing.tools.osgi.WebconsoleClient - Refresh packages.
21048 [main] INFO org.apache.sling.testing.tools.sling.BundlesInstaller - 9 additional bundles
installed
21053 [main] INFO org.apache.sling.testing.tools.sling.BundlesInstaller - Checking that bundles
are installed (timeout 20 seconds): [org.apache.sling.models.integration-tests, org.apache.sling.models.api,
org.apache.sling.models.impl, org.apache.sling.models.jacksonexporter, com.fasterxml.jackson.core.jackson-annotations,
com.fasterxml.jackson.core.jackson-core, com.fasterxml.jackson.core.jackson-databind, org.apache.geronimo.specs.geronimo-atinject_1.0_spec,
org.apache.sling.commons.johnzon]
21142 [main] INFO org.apache.sling.testing.tools.sling.BundlesInstaller - Starting bundles
(timeout 30 seconds): [org.apache.sling.models.integration-tests, org.apache.sling.models.api,
org.apache.sling.models.impl, org.apache.sling.models.jacksonexporter, com.fasterxml.jackson.core.jackson-annotations,
com.fasterxml.jackson.core.jackson-core, com.fasterxml.jackson.core.jackson-databind, org.apache.geronimo.specs.geronimo-atinject_1.0_spec,
org.apache.sling.commons.johnzon]
21155 [main] INFO org.apache.sling.testing.tools.osgi.WebconsoleClient - Starting bundle org.apache.sling.models.integration-tests
via /system/console/bundles/org.apache.sling.models.integration-tests
22479 [main] INFO org.apache.sling.testing.tools.osgi.WebconsoleClient - Starting bundle org.apache.sling.models.integration-tests
via /system/console/bundles/org.apache.sling.models.integration-tests
23800 [main] INFO org.apache.sling.testing.tools.osgi.WebconsoleClient - Starting bundle org.apache.sling.models.integration-tests
via /system/console/bundles/org.apache.sling.models.integration-tests
25128 [main] INFO org.apache.sling.testing.tools.osgi.WebconsoleClient - Starting bundle org.apache.sling.models.integration-tests
via /system/console/bundles/org.apache.sling.models.integration-tests
26447 [main] INFO org.apache.sling.testing.tools.osgi.WebconsoleClient - Starting bundle org.apache.sling.models.integration-tests
via /system/console/bundles/org.apache.sling.models.integration-tests
27766 [main] INFO org.apache.sling.testing.tools.osgi.WebconsoleClient - Starting bundle org.apache.sling.models.integration-tests
via /system/console/bundles/org.apache.sling.models.integration-tests
29086 [main] INFO org.apache.sling.testing.tools.osgi.WebconsoleClient - Starting bundle org.apache.sling.models.integration-tests
via /system/console/bundles/org.apache.sling.models.integration-tests
30405 [main] INFO org.apache.sling.testing.tools.osgi.WebconsoleClient - Starting bundle org.apache.sling.models.integration-tests
via /system/console/bundles/org.apache.sling.models.integration-tests
31724 [main] INFO org.apache.sling.testing.tools.osgi.WebconsoleClient - Starting bundle org.apache.sling.models.integration-tests
via /system/console/bundles/org.apache.sling.models.integration-tests
33045 [main] INFO org.apache.sling.testing.tools.osgi.WebconsoleClient - Starting bundle org.apache.sling.models.integration-tests
via /system/console/bundles/org.apache.sling.models.integration-tests
34365 [main] INFO org.apache.sling.testing.tools.osgi.WebconsoleClient - Starting bundle org.apache.sling.models.integration-tests
via /system/console/bundles/org.apache.sling.models.integration-tests
35687 [main] INFO org.apache.sling.testing.tools.osgi.WebconsoleClient - Starting bundle org.apache.sling.models.integration-tests
via /system/console/bundles/org.apache.sling.models.integration-tests
37005 [main] INFO org.apache.sling.testing.tools.osgi.WebconsoleClient - Starting bundle org.apache.sling.models.integration-tests
via /system/console/bundles/org.apache.sling.models.integration-tests
38325 [main] INFO org.apache.sling.testing.tools.osgi.WebconsoleClient - Starting bundle org.apache.sling.models.integration-tests
via /system/console/bundles/org.apache.sling.models.integration-tests
39648 [main] INFO org.apache.sling.testing.tools.osgi.WebconsoleClient - Starting bundle org.apache.sling.models.integration-tests
via /system/console/bundles/org.apache.sling.models.integration-tests
40968 [main] INFO org.apache.sling.testing.tools.osgi.WebconsoleClient - Starting bundle org.apache.sling.models.integration-tests
via /system/console/bundles/org.apache.sling.models.integration-tests
42290 [main] INFO org.apache.sling.testing.tools.osgi.WebconsoleClient - Starting bundle org.apache.sling.models.integration-tests
via /system/console/bundles/org.apache.sling.models.integration-tests
43608 [main] INFO org.apache.sling.testing.tools.osgi.WebconsoleClient - Starting bundle org.apache.sling.models.integration-tests
via /system/console/bundles/org.apache.sling.models.integration-tests
44927 [main] INFO org.apache.sling.testing.tools.osgi.WebconsoleClient - Starting bundle org.apache.sling.models.integration-tests
via /system/console/bundles/org.apache.sling.models.integration-tests
46248 [main] INFO org.apache.sling.testing.tools.osgi.WebconsoleClient - Starting bundle org.apache.sling.models.integration-tests
via /system/console/bundles/org.apache.sling.models.integration-tests
47566 [main] INFO org.apache.sling.testing.tools.osgi.WebconsoleClient - Starting bundle org.apache.sling.models.integration-tests
via /system/console/bundles/org.apache.sling.models.integration-tests
48899 [main] INFO org.apache.sling.testing.tools.osgi.WebconsoleClient - Starting bundle org.apache.sling.models.integration-tests
via /system/console/bundles/org.apache.sling.models.integration-tests
50226 [main] INFO org.apache.sling.testing.tools.osgi.WebconsoleClient - Starting bundle org.apache.sling.models.integration-tests
via /system/console/bundles/org.apache.sling.models.integration-tests
51534 [main] INFO org.apache.sling.models.it.RemoteIT - Exception while installing additional
bundles
java.lang.AssertionError: Some bundles did not start: [org.apache.sling.models.integration-tests]
	at org.junit.Assert.fail(Assert.java:88)
	at org.apache.sling.testing.tools.sling.BundlesInstaller.startAllBundles(BundlesInstaller.java:155)
	at org.apache.sling.testing.tools.sling.SlingTestBase.installAdditionalBundles(SlingTestBase.java:193)
	at org.apache.sling.testing.tools.sling.SlingTestBase.startServerIfNeeded(SlingTestBase.java:170)
	at org.apache.sling.testing.tools.sling.SlingTestBase.getServerBaseUrl(SlingTestBase.java:231)
	at org.apache.sling.models.it.RemoteIT.getJunitServletUrl(RemoteIT.java:28)
	at org.apache.sling.junit.remote.testrunner.SlingRemoteTestRunner.maybeExecuteTests(SlingRemoteTestRunner.java:103)
	at org.apache.sling.junit.remote.testrunner.SlingRemoteTestRunner.getChildren(SlingRemoteTestRunner.java:146)
	at org.junit.runners.ParentRunner.getFilteredChildren(ParentRunner.java:426)
	at org.junit.runners.ParentRunner.getDescription(ParentRunner.java:351)
	at org.junit.runners.Suite.describeChild(Suite.java:123)
	at org.junit.runners.Suite.describeChild(Suite.java:27)
	at org.junit.runners.ParentRunner.getDescription(ParentRunner.java:352)
	at org.apache.maven.surefire.common.junit4.JUnit4ProviderUtil.createSuiteDescription(JUnit4ProviderUtil.java:113)
	at org.apache.maven.surefire.junit4.JUnit4Provider.createTestsDescription(JUnit4Provider.java:257)
	at org.apache.maven.surefire.junit4.JUnit4Provider.invoke(JUnit4Provider.java:124)
	at org.apache.maven.surefire.booter.ForkedBooter.invokeProviderInSameClassLoader(ForkedBooter.java:203)
	at org.apache.maven.surefire.booter.ForkedBooter.runSuitesInProcess(ForkedBooter.java:155)
	at org.apache.maven.surefire.booter.ForkedBooter.main(ForkedBooter.java:103)

Results :

Tests run: 0, Failures: 0, Errors: 0, Skipped: 0

[JENKINS] Recording test results
[JENKINS] Archiving disabled
[JENKINS] Archiving disabled[INFO] ------------------------------------------------------------------------
[INFO] BUILD FAILURE
[INFO] ------------------------------------------------------------------------
[INFO] Total time: 01:16 min
[INFO] Finished at: 2017-06-01T21:42:38+00:00

[INFO] Final Memory: 46M/489M
[INFO] ------------------------------------------------------------------------
Waiting for Jenkins to finish collecting data
[ERROR] Failed to execute goal org.apache.maven.plugins:maven-failsafe-plugin:2.18.1:integration-test
(integration-test) on project org.apache.sling.models.integration-tests: Execution integration-test
of goal org.apache.maven.plugins:maven-failsafe-plugin:2.18.1:integration-test failed: There
was an error in the forked process
[ERROR] java.lang.AssertionError: Could not start all installed bundles:[<https://builds.apache.org/job/sling-bundles-extensions-models-integration-tests-1.8/ws/target/org.apache.sling.models.integration-tests-0.0.1-SNAPSHOT.jar,>
<https://builds.apache.org/job/sling-bundles-extensions-models-integration-tests-1.8/ws/target/sling/additional-bundles/org.apache.sling.models.api-1.3.5-SNAPSHOT.jar,>
<https://builds.apache.org/job/sling-bundles-extensions-models-integration-tests-1.8/ws/target/sling/additional-bundles/org.apache.sling.models.impl-1.4.3-SNAPSHOT.jar,>
<https://builds.apache.org/job/sling-bundles-extensions-models-integration-tests-1.8/ws/target/sling/additional-bundles/org.apache.sling.models.jacksonexporter-1.0.7-SNAPSHOT.jar,>
<https://builds.apache.org/job/sling-bundles-extensions-models-integration-tests-1.8/ws/target/sling/additional-bundles/jackson-annotations-2.3.2.jar,>
<https://builds.apache.org/job/sling-bundles-extensions-models-integration-tests-1.8/ws/target/sling/additional-bundles/jackson-core-2.3.2.jar,>
<https://builds.apache.org/job/sling-bundles-extensions-models-integration-tests-1.8/ws/target/sling/additional-bundles/jackson-databind-2.3.2.jar,>
<https://builds.apache.org/job/sling-bundles-extensions-models-integration-tests-1.8/ws/target/sling/additional-bundles/geronimo-atinject_1.0_spec-1.0.jar,>
<https://builds.apache.org/job/sling-bundles-extensions-models-integration-tests-1.8/ws/target/sling/additional-bundles/org.apache.sling.commons.johnzon-1.0.0.jar]>
[ERROR] at org.junit.Assert.fail(Assert.java:88)
[ERROR] at org.apache.sling.testing.tools.sling.SlingTestBase.installAdditionalBundles(SlingTestBase.java:203)
[ERROR] at org.apache.sling.testing.tools.sling.SlingTestBase.startServerIfNeeded(SlingTestBase.java:170)
[ERROR] at org.apache.sling.testing.tools.sling.SlingTestBase.getServerBaseUrl(SlingTestBase.java:231)
[ERROR] at org.apache.sling.models.it.RemoteIT.getJunitServletUrl(RemoteIT.java:28)
[ERROR] at org.apache.sling.junit.remote.testrunner.SlingRemoteTestRunner.maybeExecuteTests(SlingRemoteTestRunner.java:103)
[ERROR] at org.apache.sling.junit.remote.testrunner.SlingRemoteTestRunner.getChildren(SlingRemoteTestRunner.java:146)
[ERROR] at org.junit.runners.ParentRunner.getFilteredChildren(ParentRunner.java:426)
[ERROR] at org.junit.runners.ParentRunner.getDescription(ParentRunner.java:351)
[ERROR] at org.junit.runners.Suite.describeChild(Suite.java:123)
[ERROR] at org.junit.runners.Suite.describeChild(Suite.java:27)
[ERROR] at org.junit.runners.ParentRunner.getDescription(ParentRunner.java:352)
[ERROR] at org.apache.maven.surefire.common.junit4.JUnit4ProviderUtil.createSuiteDescription(JUnit4ProviderUtil.java:113)
[ERROR] at org.apache.maven.surefire.junit4.JUnit4Provider.createTestsDescription(JUnit4Provider.java:257)
[ERROR] at org.apache.maven.surefire.junit4.JUnit4Provider.invoke(JUnit4Provider.java:124)
[ERROR] at org.apache.maven.surefire.booter.ForkedBooter.invokeProviderInSameClassLoader(ForkedBooter.java:203)
[ERROR] at org.apache.maven.surefire.booter.ForkedBooter.runSuitesInProcess(ForkedBooter.java:155)
[ERROR] at org.apache.maven.surefire.booter.ForkedBooter.main(ForkedBooter.java:103)
[ERROR] -> [Help 1]
[ERROR] 
[ERROR] To see the full stack trace of the errors, re-run Maven with the -e switch.
[ERROR] Re-run Maven using the -X switch to enable full debug logging.
[ERROR] 
[ERROR] For more information about the errors and possible solutions, please read the following
articles:
[ERROR] [Help 1] http://cwiki.apache.org/confluence/display/MAVEN/PluginExecutionException
channel stopped
Recording test results

Mime
View raw message