sling-commits mailing list archives

Site index · List index
Message view « Date » · « Thread »
Top « Date » · « Thread »
From Apache Jenkins Server <jenk...@builds.apache.org>
Subject Build failed in Jenkins: sling-launchpad-test-bundles-1.8 #27
Date Wed, 07 Jun 2017 08:11:17 GMT
See <https://builds.apache.org/job/sling-launchpad-test-bundles-1.8/27/display/redirect?page=changes>

Changes:

[rombert] [maven-release-plugin] prepare for next development iteration

[rombert] [maven-release-plugin] prepare release org.apache.sling.launchpad.test-bundles-0.0.2

[rombert] launchpad/test-bundles: add scm information

[rombert] [maven-release-plugin] rollback the release of org.apache.sling.launchpad.test-bundles-0.0.2

[rombert] [maven-release-plugin] prepare release org.apache.sling.launchpad.test-bundles-0.0.2

[rombert] Update to latest parent POM

[rombert] [maven-release-plugin] rollback the release of org.apache.sling.launchpad.test-bundles-0.0.2

------------------------------------------
Started by an SCM change
[EnvInject] - Loading node environment variables.
Building remotely on H24 (ubuntu xenial) in workspace <https://builds.apache.org/job/sling-launchpad-test-bundles-1.8/ws/>
Updating https://svn.apache.org/repos/asf/sling/trunk/launchpad/test-bundles at revision '2017-06-07T08:10:03.371
+0000'
U         src/main/provisioning/bundles.txt
U         pom.xml
At revision 1797885

Parsing POMs
Modules changed, recalculating dependency graph
Established TCP socket on 36660
maven33-agent.jar already up to date
maven33-interceptor.jar already up to date
maven3-interceptor-commons.jar already up to date
[sling-launchpad-test-bundles-1.8] $ /home/jenkins/tools/java/latest1.8/bin/java -Xmx2g -Xms256m
-cp /home/jenkins/jenkins-slave/maven33-agent.jar:/home/jenkins/tools/maven/apache-maven-3.3.9/boot/plexus-classworlds-2.5.2.jar:/home/jenkins/tools/maven/apache-maven-3.3.9/conf/logging
jenkins.maven3.agent.Maven33Main /home/jenkins/tools/maven/apache-maven-3.3.9 /home/jenkins/jenkins-slave/slave.jar
/home/jenkins/jenkins-slave/maven33-interceptor.jar /home/jenkins/jenkins-slave/maven3-interceptor-commons.jar
36660
<===[JENKINS REMOTING CAPACITY]===>   channel started
Executing Maven:  -B -f <https://builds.apache.org/job/sling-launchpad-test-bundles-1.8/ws/pom.xml>
-Dmaven.repo.local=/home/jenkins/jenkins-slave/maven-repositories/0 -U clean deploy
[INFO] Scanning for projects...
[INFO]                                                                         
[INFO] ------------------------------------------------------------------------
[INFO] Building Apache Sling Launchpad Test Bundles 0.0.3-SNAPSHOT
[INFO] ------------------------------------------------------------------------
[INFO] Downloading: https://repo.maven.apache.org/maven2/org/apache/sling/org.apache.sling.junit.core/1.0.26/org.apache.sling.junit.core-1.0.26.pom
[INFO] Downloaded: https://repo.maven.apache.org/maven2/org/apache/sling/org.apache.sling.junit.core/1.0.26/org.apache.sling.junit.core-1.0.26.pom
(9 KB at 18.2 KB/sec)
[INFO] Downloading: https://repo.maven.apache.org/maven2/org/apache/sling/org.apache.sling.junit.remote/1.0.12/org.apache.sling.junit.remote-1.0.12.pom
[INFO] Downloaded: https://repo.maven.apache.org/maven2/org/apache/sling/org.apache.sling.junit.remote/1.0.12/org.apache.sling.junit.remote-1.0.12.pom
(6 KB at 244.7 KB/sec)
[INFO] Downloading: https://repo.maven.apache.org/maven2/org/apache/sling/org.apache.sling.testing.tools/1.0.16/org.apache.sling.testing.tools-1.0.16.pom
[INFO] Downloaded: https://repo.maven.apache.org/maven2/org/apache/sling/org.apache.sling.testing.tools/1.0.16/org.apache.sling.testing.tools-1.0.16.pom
(6 KB at 242.8 KB/sec)
[INFO] Downloading: https://repo.maven.apache.org/maven2/org/apache/sling/org.apache.sling.junit.scriptable/1.0.12/org.apache.sling.junit.scriptable-1.0.12.pom
[INFO] Downloaded: https://repo.maven.apache.org/maven2/org/apache/sling/org.apache.sling.junit.scriptable/1.0.12/org.apache.sling.junit.scriptable-1.0.12.pom
(6 KB at 230.2 KB/sec)
[INFO] Downloading: https://repo.maven.apache.org/maven2/org/apache/sling/org.apache.sling.launchpad.test-fragment/2.0.12/org.apache.sling.launchpad.test-fragment-2.0.12.pom
[WARNING] The POM for org.apache.sling:org.apache.sling.launchpad.test-fragment:jar:2.0.12
is missing, no dependency information available
[INFO] Downloading: https://repo.maven.apache.org/maven2/org/apache/sling/org.apache.sling.launchpad.test-services/2.0.12/org.apache.sling.launchpad.test-services-2.0.12.pom
[WARNING] The POM for org.apache.sling:org.apache.sling.launchpad.test-services:jar:2.0.12
is missing, no dependency information available
[INFO] Downloading: https://repo.maven.apache.org/maven2/org/apache/sling/org.apache.sling.junit.core/1.0.26/org.apache.sling.junit.core-1.0.26.jar
[INFO] Downloading: https://repo.maven.apache.org/maven2/org/apache/sling/org.apache.sling.junit.remote/1.0.12/org.apache.sling.junit.remote-1.0.12.jar
[INFO] Downloading: https://repo.maven.apache.org/maven2/org/apache/sling/org.apache.sling.junit.scriptable/1.0.12/org.apache.sling.junit.scriptable-1.0.12.jar
[INFO] Downloading: https://repo.maven.apache.org/maven2/org/apache/sling/org.apache.sling.testing.tools/1.0.16/org.apache.sling.testing.tools-1.0.16.jar
[INFO] Downloading: https://repo.maven.apache.org/maven2/org/apache/sling/org.apache.sling.launchpad.test-fragment/2.0.12/org.apache.sling.launchpad.test-fragment-2.0.12.jar
[INFO] Downloading: https://repo.maven.apache.org/maven2/org/apache/sling/org.apache.sling.launchpad.test-services/2.0.12/org.apache.sling.launchpad.test-services-2.0.12.jar
[INFO] Downloaded: https://repo.maven.apache.org/maven2/org/apache/sling/org.apache.sling.junit.remote/1.0.12/org.apache.sling.junit.remote-1.0.12.jar
(33 KB at 219.9 KB/sec)
[INFO] Downloaded: https://repo.maven.apache.org/maven2/org/apache/sling/org.apache.sling.junit.scriptable/1.0.12/org.apache.sling.junit.scriptable-1.0.12.jar
(24 KB at 168.5 KB/sec)
[INFO] Downloaded: https://repo.maven.apache.org/maven2/org/apache/sling/org.apache.sling.testing.tools/1.0.16/org.apache.sling.testing.tools-1.0.16.jar
(79 KB at 500.9 KB/sec)
[INFO] Downloaded: https://repo.maven.apache.org/maven2/org/apache/sling/org.apache.sling.junit.core/1.0.26/org.apache.sling.junit.core-1.0.26.jar
(448 KB at 1938.9 KB/sec)
[JENKINS] Archiving disabled
[INFO] ------------------------------------------------------------------------
[JENKINS] Archiving disabled[INFO] BUILD FAILURE
[INFO] ------------------------------------------------------------------------
[INFO] Total time: 8.259 s
[INFO] Finished at: 2017-06-07T08:11:12+00:00

[INFO] Final Memory: 16M/271M
[INFO] ------------------------------------------------------------------------
Waiting for Jenkins to finish collecting data
[ERROR] Failed to execute goal on project org.apache.sling.launchpad.test-bundles: Could not
resolve dependencies for project org.apache.sling:org.apache.sling.launchpad.test-bundles:slingfeature:0.0.3-SNAPSHOT:
The following artifacts could not be resolved: org.apache.sling:org.apache.sling.launchpad.test-fragment:jar:2.0.12,
org.apache.sling:org.apache.sling.launchpad.test-services:jar:2.0.12: Could not find artifact
org.apache.sling:org.apache.sling.launchpad.test-fragment:jar:2.0.12 in central (https://repo.maven.apache.org/maven2)
-> [Help 1]
[ERROR] 
[ERROR] To see the full stack trace of the errors, re-run Maven with the -e switch.
[ERROR] Re-run Maven using the -X switch to enable full debug logging.
[ERROR] 
[ERROR] For more information about the errors and possible solutions, please read the following
articles:
[ERROR] [Help 1] http://cwiki.apache.org/confluence/display/MAVEN/DependencyResolutionException
channel stopped
Recording test results

Mime
View raw message