sling-commits mailing list archives

Site index · List index
Message view « Date » · « Thread »
Top « Date » · « Thread »
From Apache Jenkins Server <jenk...@builds.apache.org>
Subject Build failed in Jenkins: sling-bundles-scripting-sightly-engine-1.7 #65
Date Fri, 05 May 2017 12:46:36 GMT
See <https://builds.apache.org/job/sling-bundles-scripting-sightly-engine-1.7/65/display/redirect?page=changes>

Changes:

[radu] [maven-release-plugin] prepare for next development iteration

[radu] [maven-release-plugin] prepare release org.apache.sling.scripting.sightly-1.0.34

[radu] releng: updated to released xss dependency

------------------------------------------
Started by an SCM change
[EnvInject] - Loading node environment variables.
Building remotely on ubuntu-2 (ubuntu trusty) in workspace <https://builds.apache.org/job/sling-bundles-scripting-sightly-engine-1.7/ws/>
Updating https://svn.apache.org/repos/asf/sling/trunk/bundles/scripting/sightly/engine at
revision '2017-05-05T12:45:13.984 +0000'
U         pom.xml
At revision 1794043

Parsing POMs
Modules changed, recalculating dependency graph
Established TCP socket on 53849
maven33-agent.jar already up to date
maven33-interceptor.jar already up to date
maven3-interceptor-commons.jar already up to date
[sling-bundles-scripting-sightly-engine-1.7] $ /home/jenkins/tools/java/latest1.7/bin/java
-Xmx2g -Xms256m -cp /home/jenkins/jenkins-slave/maven33-agent.jar:/home/jenkins/tools/maven/apache-maven-3.3.9/boot/plexus-classworlds-2.5.2.jar:/home/jenkins/tools/maven/apache-maven-3.3.9/conf/logging
jenkins.maven3.agent.Maven33Main /home/jenkins/tools/maven/apache-maven-3.3.9 /home/jenkins/jenkins-slave/slave.jar
/home/jenkins/jenkins-slave/maven33-interceptor.jar /home/jenkins/jenkins-slave/maven3-interceptor-commons.jar
53849
<===[JENKINS REMOTING CAPACITY]===>   channel started
Executing Maven:  -B -f <https://builds.apache.org/job/sling-bundles-scripting-sightly-engine-1.7/ws/pom.xml>
-Dmaven.repo.local=/home/jenkins/jenkins-slave/maven-repositories/0 -U clean deploy
[INFO] Scanning for projects...
[INFO]                                                                         
[INFO] ------------------------------------------------------------------------
[INFO] Building Apache Sling Scripting HTL Engine 1.0.35-SNAPSHOT
[INFO] ------------------------------------------------------------------------
[INFO] Downloading: https://repo.maven.apache.org/maven2/org/apache/sling/org.apache.sling.scripting.sightly.compiler.java/1.0.10/org.apache.sling.scripting.sightly.compiler.java-1.0.10.pom
[WARNING] The POM for org.apache.sling:org.apache.sling.scripting.sightly.compiler.java:jar:1.0.10
is missing, no dependency information available
[INFO] Downloading: https://repo.maven.apache.org/maven2/org/apache/sling/org.apache.sling.xss/2.0.0/org.apache.sling.xss-2.0.0.pom
[INFO] Downloaded: https://repo.maven.apache.org/maven2/org/apache/sling/org.apache.sling.xss/2.0.0/org.apache.sling.xss-2.0.0.pom
(13 KB at 219.9 KB/sec)
[INFO] Downloading: https://repo.maven.apache.org/maven2/org/apache/sling/org.apache.sling.scripting.sightly.compiler.java/1.0.10/org.apache.sling.scripting.sightly.compiler.java-1.0.10.jar
[INFO] Downloading: https://repo.maven.apache.org/maven2/org/apache/sling/org.apache.sling.xss/2.0.0/org.apache.sling.xss-2.0.0.jar
[INFO] Downloaded: https://repo.maven.apache.org/maven2/org/apache/sling/org.apache.sling.xss/2.0.0/org.apache.sling.xss-2.0.0.jar
(2669 KB at 7060.6 KB/sec)
[JENKINS] Archiving disabled
[JENKINS] Archiving disabled[INFO] ------------------------------------------------------------------------
[INFO] BUILD FAILURE
[INFO] ------------------------------------------------------------------------
[INFO] Total time: 10.274 s
[INFO] Finished at: 2017-05-05T12:46:29+00:00

[INFO] Final Memory: 17M/246M
[INFO] ------------------------------------------------------------------------
Waiting for Jenkins to finish collecting data[ERROR] Failed to execute goal on project org.apache.sling.scripting.sightly:
Could not resolve dependencies for project org.apache.sling:org.apache.sling.scripting.sightly:bundle:1.0.35-SNAPSHOT:
Could not find artifact org.apache.sling:org.apache.sling.scripting.sightly.compiler.java:jar:1.0.10
in central (https://repo.maven.apache.org/maven2) -> [Help 1]
[ERROR] 
[ERROR] To see the full stack trace of the errors, re-run Maven with the -e switch.
[ERROR] Re-run Maven using the -X switch to enable full debug logging.
[ERROR] 
[ERROR] For more information about the errors and possible solutions, please read the following
articles:
[ERROR] [Help 1] http://cwiki.apache.org/confluence/display/MAVEN/DependencyResolutionException

channel stopped
Recording test results
ERROR: Step ?Publish JUnit test result report? failed: Test reports were found but none of
them are new. Did tests run? 
For example, <https://builds.apache.org/job/sling-bundles-scripting-sightly-engine-1.7/ws/target/surefire-reports/TEST-org.apache.sling.scripting.sightly.impl.compiler.SightlyJavaCompilerServiceTest.xml>
is 7 days 2 hr old



Mime
View raw message