sling-commits mailing list archives

Site index · List index
Message view « Date » · « Thread »
Top « Date » · « Thread »
From Apache Jenkins Server <jenk...@builds.apache.org>
Subject Build failed in Jenkins: sling-contrib-extensions-distribution-core-1.8 #50
Date Thu, 04 May 2017 14:11:54 GMT
See <https://builds.apache.org/job/sling-contrib-extensions-distribution-core-1.8/50/display/redirect?page=changes>

Changes:

[tommaso] SLING-5952 - added timeout configs to http transport

------------------------------------------
[...truncated 23.08 KB...]
A         src/test/java/org/apache/sling/distribution/packaging/impl/importer
AU        src/test/java/org/apache/sling/distribution/packaging/impl/importer/LocalDistributionPackageImporterTest.java
AU        src/test/java/org/apache/sling/distribution/packaging/impl/importer/RemoteDistributionPackageImporterTest.java
AU        src/test/java/org/apache/sling/distribution/packaging/impl/importer/RepositoryDistributionPackageImporterTest.java
A         src/test/java/org/apache/sling/distribution/queue
A         src/test/java/org/apache/sling/distribution/queue/impl
A         src/test/java/org/apache/sling/distribution/queue/impl/jobhandling
AU        src/test/java/org/apache/sling/distribution/queue/impl/jobhandling/JobHandlingDistributionQueueProviderTest.java
A         src/test/java/org/apache/sling/distribution/queue/impl/jobhandling/JobHandlingUtilsTest.java
A         src/test/java/org/apache/sling/distribution/queue/impl/jobhandling/JobHandlingDistributionQueueTest.java
AU        src/test/java/org/apache/sling/distribution/queue/impl/jobhandling/DistributionAgentJobConsumerTest.java
AU        src/test/java/org/apache/sling/distribution/queue/impl/AsyncDeliveryDispatchingStrategyTest.java
A         src/test/java/org/apache/sling/distribution/queue/impl/PriorityQueueDispatchingStrategyTest.java
A         src/test/java/org/apache/sling/distribution/queue/impl/SingleQueueDistributionStrategyTest.java
A         src/test/java/org/apache/sling/distribution/queue/impl/simple
AU        src/test/java/org/apache/sling/distribution/queue/impl/simple/SimpleDistributionQueueCheckpointTest.java
AU        src/test/java/org/apache/sling/distribution/queue/impl/simple/SimpleDistributionQueueProviderTest.java
AU        src/test/java/org/apache/sling/distribution/queue/impl/simple/SimpleDistributionQueueProcessorTest.java
A         src/test/java/org/apache/sling/distribution/queue/impl/simple/SimpleDistributionQueueTest.java
A         src/test/java/org/apache/sling/distribution/monitor
AU        src/test/java/org/apache/sling/distribution/monitor/DistributionQueueHealthCheckTest.java
A         src/test/java/org/apache/sling/distribution/monitor/impl
AU        src/test/java/org/apache/sling/distribution/monitor/impl/ForwardDistributionAgentMBeanTest.java
AU        src/test/java/org/apache/sling/distribution/monitor/impl/QueueDistributionAgentMBeanTest.java
AU        src/test/java/org/apache/sling/distribution/monitor/impl/DistributionQueueMBeanTest.java
AU        src/test/java/org/apache/sling/distribution/monitor/impl/SimpleDistributionAgentMBeanTest.java
AU        src/test/java/org/apache/sling/distribution/monitor/impl/ReverseDistributionAgentMBeanTest.java
AU        src/test/java/org/apache/sling/distribution/monitor/impl/DistributionPackageMBeanTest.java
AU        src/test/java/org/apache/sling/distribution/monitor/impl/SyncDistributionAgentMBeanTest.java
AU        src/test/java/org/apache/sling/distribution/monitor/impl/UserCredentialsDistributionTransportSecretMBeanTest.java
A         src/test/java/org/apache/sling/distribution/transport
A         src/test/java/org/apache/sling/distribution/transport/impl
AU        src/test/java/org/apache/sling/distribution/transport/impl/SimpleHttpDistributionTransportTest.java
A         src/test/java/org/apache/sling/distribution/serialization
A         src/test/java/org/apache/sling/distribution/serialization/impl
A         src/test/java/org/apache/sling/distribution/serialization/impl/vlt
AU        src/test/java/org/apache/sling/distribution/serialization/impl/vlt/FileVaultContentSerializerTest.java
A         src/test/java/org/apache/sling/distribution/serialization/impl/vlt/VltUtilsTest.java
AU        src/test/java/org/apache/sling/distribution/serialization/DistributionExportFilterTest.java
A         src/test/java/org/apache/sling/distribution/util
A         src/test/java/org/apache/sling/distribution/util/impl
AU        src/test/java/org/apache/sling/distribution/util/impl/FileBackedMemoryOutputStreamTest.java
A         src/test/java/org/apache/sling/distribution/agent
A         src/test/java/org/apache/sling/distribution/agent/impl
A         src/test/java/org/apache/sling/distribution/agent/impl/SimpleDistributionAgentTest.java
AU        src/test/java/org/apache/sling/distribution/agent/impl/TriggerAgentRequestHandlerTest.java
AU        src/test/java/org/apache/sling/distribution/agent/impl/SimpleDistributionAgentQueueProcessorTest.java
AU        src/test/java/org/apache/sling/distribution/agent/impl/QueueingDistributionPackageProcessorTest.java
AU        src/test/java/org/apache/sling/distribution/agent/impl/PrivilegeDistributionRequestAuthorizationStrategyTest.java
AU        src/test/java/org/apache/sling/distribution/agent/impl/ImportingDistributionPackageProcessorTest.java
AU        src/test/java/org/apache/sling/distribution/agent/impl/SimpleDistributionAgentAuthenticationInfoTest.java
A         pom.xml
 U        .
At revision 1793808

Parsing POMs
Established TCP socket on 60140
maven33-agent.jar already up to date
maven33-interceptor.jar already up to date
maven3-interceptor-commons.jar already up to date
[sling-contrib-extensions-distribution-core-1.8] $ /home/jenkins/tools/java/latest1.8/bin/java
-Xmx2g -Xms256m -cp /home/jenkins/jenkins-slave/maven33-agent.jar:/home/jenkins/tools/maven/apache-maven-3.3.9/boot/plexus-classworlds-2.5.2.jar:/home/jenkins/tools/maven/apache-maven-3.3.9/conf/logging
jenkins.maven3.agent.Maven33Main /home/jenkins/tools/maven/apache-maven-3.3.9 /home/jenkins/jenkins-slave/slave.jar
/home/jenkins/jenkins-slave/maven33-interceptor.jar /home/jenkins/jenkins-slave/maven3-interceptor-commons.jar
60140
<===[JENKINS REMOTING CAPACITY]===>   channel started
Executing Maven:  -B -f <https://builds.apache.org/job/sling-contrib-extensions-distribution-core-1.8/ws/pom.xml>
-Dmaven.repo.local=/home/jenkins/jenkins-slave/maven-repositories/0 -U clean verify
[INFO] Scanning for projects...
[INFO]                                                                         
[INFO] ------------------------------------------------------------------------
[INFO] Building Apache Sling Distribution Core 0.2.7-SNAPSHOT
[INFO] ------------------------------------------------------------------------
[INFO] 
[INFO] --- maven-clean-plugin:2.5:clean (default-clean) @ org.apache.sling.distribution.core
---
[INFO] 
[INFO] --- maven-enforcer-plugin:1.3.1:enforce (enforce-java) @ org.apache.sling.distribution.core
---
[INFO] 
[INFO] --- maven-antrun-plugin:1.8:run (set-bundle-required-execution-environment) @ org.apache.sling.distribution.core
---
[INFO] Executing tasks

main:
[INFO] Executed tasks
[INFO] 
[INFO] --- maven-remote-resources-plugin:1.5:process (default) @ org.apache.sling.distribution.core
---
[INFO] 
[INFO] --- maven-resources-plugin:2.7:resources (default-resources) @ org.apache.sling.distribution.core
---
[INFO] Using 'UTF-8' encoding to copy filtered resources.
[INFO] skip non existing resourceDirectory <https://builds.apache.org/job/sling-contrib-extensions-distribution-core-1.8/ws/src/main/resources>
[INFO] Copying 3 resources
[INFO] 
[INFO] --- maven-antrun-plugin:1.8:run (check-memory-task) @ org.apache.sling.distribution.core
---
[INFO] Executing tasks

main:
     [echo] **************** WARNING (SLING-443/SLING-1782) ******************************
     [echo] On most platforms, you'll get OutOfMemoryErrors when building unless you set
     [echo] on 32bit platforms: MAVEN_OPTS="-Xmx256M -XX:MaxPermSize=256M", see SLING-443
     [echo] on 64bit platforms: MAVEN_OPTS="-Xmx512M -XX:MaxPermSize=512M", see SLING-1782
     [echo] ******************************************************************************
[INFO] Executed tasks
[INFO] 
[INFO] --- maven-compiler-plugin:3.2:compile (default-compile) @ org.apache.sling.distribution.core
---
[INFO] Changes detected - recompiling the module!
[INFO] Compiling 178 source files to <https://builds.apache.org/job/sling-contrib-extensions-distribution-core-1.8/ws/target/classes>
[INFO] <https://builds.apache.org/job/sling-contrib-extensions-distribution-core-1.8/ws/src/main/java/org/apache/sling/distribution/resources/impl/common/AbstractReadableResourceProvider.java>:
Some input files use or override a deprecated API.
[INFO] <https://builds.apache.org/job/sling-contrib-extensions-distribution-core-1.8/ws/src/main/java/org/apache/sling/distribution/resources/impl/common/AbstractReadableResourceProvider.java>:
Recompile with -Xlint:deprecation for details.
[INFO] <https://builds.apache.org/job/sling-contrib-extensions-distribution-core-1.8/ws/src/main/java/org/apache/sling/distribution/resources/impl/common/SimpleReadableResource.java>:
Some input files use unchecked or unsafe operations.
[INFO] <https://builds.apache.org/job/sling-contrib-extensions-distribution-core-1.8/ws/src/main/java/org/apache/sling/distribution/resources/impl/common/SimpleReadableResource.java>:
Recompile with -Xlint:unchecked for details.
[INFO] -------------------------------------------------------------
[ERROR] COMPILATION ERROR : 
[INFO] -------------------------------------------------------------
[ERROR] <https://builds.apache.org/job/sling-contrib-extensions-distribution-core-1.8/ws/src/main/java/org/apache/sling/distribution/agent/impl/ForwardDistributionAgentFactory.java>:[64,52]
cannot find symbol
  symbol:   class HttpConfiguration
  location: package org.apache.sling.distribution.transport.impl
[ERROR] <https://builds.apache.org/job/sling-contrib-extensions-distribution-core-1.8/ws/src/main/java/org/apache/sling/distribution/packaging/impl/exporter/RemoteDistributionPackageExporterFactory.java>:[44,52]
cannot find symbol
  symbol:   class HttpConfiguration
  location: package org.apache.sling.distribution.transport.impl
[ERROR] <https://builds.apache.org/job/sling-contrib-extensions-distribution-core-1.8/ws/src/main/java/org/apache/sling/distribution/agent/impl/SyncDistributionAgentFactory.java>:[45,52]
cannot find symbol
  symbol:   class HttpConfiguration
  location: package org.apache.sling.distribution.transport.impl
[ERROR] <https://builds.apache.org/job/sling-contrib-extensions-distribution-core-1.8/ws/src/main/java/org/apache/sling/distribution/packaging/impl/importer/RemoteDistributionPackageImporter.java>:[45,80]
cannot find symbol
  symbol:   class HttpConfiguration
  location: class org.apache.sling.distribution.packaging.impl.importer.RemoteDistributionPackageImporter
[ERROR] <https://builds.apache.org/job/sling-contrib-extensions-distribution-core-1.8/ws/src/main/java/org/apache/sling/distribution/transport/impl/HttpTransportUtils.java>:[35,88]
cannot find symbol
  symbol:   class HttpConfiguration
  location: class org.apache.sling.distribution.transport.impl.HttpTransportUtils
[ERROR] <https://builds.apache.org/job/sling-contrib-extensions-distribution-core-1.8/ws/src/main/java/org/apache/sling/distribution/packaging/impl/importer/RemoteDistributionPackageImporterFactory.java>:[43,52]
cannot find symbol
  symbol:   class HttpConfiguration
  location: package org.apache.sling.distribution.transport.impl
[ERROR] <https://builds.apache.org/job/sling-contrib-extensions-distribution-core-1.8/ws/src/main/java/org/apache/sling/distribution/transport/impl/SimpleHttpDistributionTransport.java>:[74,19]
cannot find symbol
  symbol:   class HttpConfiguration
  location: class org.apache.sling.distribution.transport.impl.SimpleHttpDistributionTransport
[ERROR] <https://builds.apache.org/job/sling-contrib-extensions-distribution-core-1.8/ws/src/main/java/org/apache/sling/distribution/transport/impl/SimpleHttpDistributionTransport.java>:[80,44]
cannot find symbol
  symbol:   class HttpConfiguration
  location: class org.apache.sling.distribution.transport.impl.SimpleHttpDistributionTransport
[ERROR] <https://builds.apache.org/job/sling-contrib-extensions-distribution-core-1.8/ws/src/main/java/org/apache/sling/distribution/packaging/impl/exporter/RemoteDistributionPackageExporter.java>:[52,84]
cannot find symbol
  symbol:   class HttpConfiguration
  location: class org.apache.sling.distribution.packaging.impl.exporter.RemoteDistributionPackageExporter
[ERROR] <https://builds.apache.org/job/sling-contrib-extensions-distribution-core-1.8/ws/src/main/java/org/apache/sling/distribution/agent/impl/ReverseDistributionAgentFactory.java>:[56,52]
cannot find symbol
  symbol:   class HttpConfiguration
  location: package org.apache.sling.distribution.transport.impl
[ERROR] <https://builds.apache.org/job/sling-contrib-extensions-distribution-core-1.8/ws/src/main/java/org/apache/sling/distribution/agent/impl/ForwardDistributionAgentFactory.java>:[250,9]
cannot find symbol
  symbol:   class HttpConfiguration
  location: class org.apache.sling.distribution.agent.impl.ForwardDistributionAgentFactory
[ERROR] <https://builds.apache.org/job/sling-contrib-extensions-distribution-core-1.8/ws/src/main/java/org/apache/sling/distribution/agent/impl/ForwardDistributionAgentFactory.java>:[250,51]
cannot find symbol
  symbol:   class HttpConfiguration
  location: class org.apache.sling.distribution.agent.impl.ForwardDistributionAgentFactory
[ERROR] <https://builds.apache.org/job/sling-contrib-extensions-distribution-core-1.8/ws/src/main/java/org/apache/sling/distribution/packaging/impl/exporter/RemoteDistributionPackageExporterFactory.java>:[112,9]
cannot find symbol
  symbol:   class HttpConfiguration
  location: class org.apache.sling.distribution.packaging.impl.exporter.RemoteDistributionPackageExporterFactory
[ERROR] <https://builds.apache.org/job/sling-contrib-extensions-distribution-core-1.8/ws/src/main/java/org/apache/sling/distribution/packaging/impl/exporter/RemoteDistributionPackageExporterFactory.java>:[112,51]
cannot find symbol
  symbol:   class HttpConfiguration
  location: class org.apache.sling.distribution.packaging.impl.exporter.RemoteDistributionPackageExporterFactory
[ERROR] <https://builds.apache.org/job/sling-contrib-extensions-distribution-core-1.8/ws/src/main/java/org/apache/sling/distribution/agent/impl/SyncDistributionAgentFactory.java>:[235,9]
cannot find symbol
  symbol:   class HttpConfiguration
  location: class org.apache.sling.distribution.agent.impl.SyncDistributionAgentFactory
[ERROR] <https://builds.apache.org/job/sling-contrib-extensions-distribution-core-1.8/ws/src/main/java/org/apache/sling/distribution/agent/impl/SyncDistributionAgentFactory.java>:[235,51]
cannot find symbol
  symbol:   class HttpConfiguration
  location: class org.apache.sling.distribution.agent.impl.SyncDistributionAgentFactory
[ERROR] <https://builds.apache.org/job/sling-contrib-extensions-distribution-core-1.8/ws/src/main/java/org/apache/sling/distribution/packaging/impl/importer/RemoteDistributionPackageImporterFactory.java>:[88,9]
cannot find symbol
  symbol:   class HttpConfiguration
  location: class org.apache.sling.distribution.packaging.impl.importer.RemoteDistributionPackageImporterFactory
[ERROR] <https://builds.apache.org/job/sling-contrib-extensions-distribution-core-1.8/ws/src/main/java/org/apache/sling/distribution/packaging/impl/importer/RemoteDistributionPackageImporterFactory.java>:[88,51]
cannot find symbol
  symbol:   class HttpConfiguration
  location: class org.apache.sling.distribution.packaging.impl.importer.RemoteDistributionPackageImporterFactory
[ERROR] <https://builds.apache.org/job/sling-contrib-extensions-distribution-core-1.8/ws/src/main/java/org/apache/sling/distribution/agent/impl/ReverseDistributionAgentFactory.java>:[198,9]
cannot find symbol
  symbol:   class HttpConfiguration
  location: class org.apache.sling.distribution.agent.impl.ReverseDistributionAgentFactory
[ERROR] <https://builds.apache.org/job/sling-contrib-extensions-distribution-core-1.8/ws/src/main/java/org/apache/sling/distribution/agent/impl/ReverseDistributionAgentFactory.java>:[198,51]
cannot find symbol
  symbol:   class HttpConfiguration
  location: class org.apache.sling.distribution.agent.impl.ReverseDistributionAgentFactory
[INFO] 20 errors 
[INFO] -------------------------------------------------------------
[JENKINS] Archiving disabled
[JENKINS] Archiving disabled[INFO] ------------------------------------------------------------------------
[INFO] BUILD FAILURE
[INFO] ------------------------------------------------------------------------
[INFO] Total time: 10.636 s
[INFO] Finished at: 2017-05-04T14:11:50+00:00

[INFO] Final Memory: 34M/451M
[INFO] ------------------------------------------------------------------------
Waiting for Jenkins to finish collecting data
[ERROR] Failed to execute goal org.apache.maven.plugins:maven-compiler-plugin:3.2:compile
(default-compile) on project org.apache.sling.distribution.core: Compilation failure: Compilation
failure:
[ERROR] <https://builds.apache.org/job/sling-contrib-extensions-distribution-core-1.8/ws/src/main/java/org/apache/sling/distribution/agent/impl/ForwardDistributionAgentFactory.java>:[64,52]
cannot find symbol
[ERROR] symbol:   class HttpConfiguration
[ERROR] location: package org.apache.sling.distribution.transport.impl
[ERROR] <https://builds.apache.org/job/sling-contrib-extensions-distribution-core-1.8/ws/src/main/java/org/apache/sling/distribution/packaging/impl/exporter/RemoteDistributionPackageExporterFactory.java>:[44,52]
cannot find symbol
[ERROR] symbol:   class HttpConfiguration
[ERROR] location: package org.apache.sling.distribution.transport.impl
[ERROR] <https://builds.apache.org/job/sling-contrib-extensions-distribution-core-1.8/ws/src/main/java/org/apache/sling/distribution/agent/impl/SyncDistributionAgentFactory.java>:[45,52]
cannot find symbol
[ERROR] symbol:   class HttpConfiguration
[ERROR] location: package org.apache.sling.distribution.transport.impl
[ERROR] <https://builds.apache.org/job/sling-contrib-extensions-distribution-core-1.8/ws/src/main/java/org/apache/sling/distribution/packaging/impl/importer/RemoteDistributionPackageImporter.java>:[45,80]
cannot find symbol
[ERROR] symbol:   class HttpConfiguration
[ERROR] location: class org.apache.sling.distribution.packaging.impl.importer.RemoteDistributionPackageImporter
[ERROR] <https://builds.apache.org/job/sling-contrib-extensions-distribution-core-1.8/ws/src/main/java/org/apache/sling/distribution/transport/impl/HttpTransportUtils.java>:[35,88]
cannot find symbol
[ERROR] symbol:   class HttpConfiguration
[ERROR] location: class org.apache.sling.distribution.transport.impl.HttpTransportUtils
[ERROR] <https://builds.apache.org/job/sling-contrib-extensions-distribution-core-1.8/ws/src/main/java/org/apache/sling/distribution/packaging/impl/importer/RemoteDistributionPackageImporterFactory.java>:[43,52]
cannot find symbol
[ERROR] symbol:   class HttpConfiguration
[ERROR] location: package org.apache.sling.distribution.transport.impl
[ERROR] <https://builds.apache.org/job/sling-contrib-extensions-distribution-core-1.8/ws/src/main/java/org/apache/sling/distribution/transport/impl/SimpleHttpDistributionTransport.java>:[74,19]
cannot find symbol
[ERROR] symbol:   class HttpConfiguration
[ERROR] location: class org.apache.sling.distribution.transport.impl.SimpleHttpDistributionTransport
[ERROR] <https://builds.apache.org/job/sling-contrib-extensions-distribution-core-1.8/ws/src/main/java/org/apache/sling/distribution/transport/impl/SimpleHttpDistributionTransport.java>:[80,44]
cannot find symbol
[ERROR] symbol:   class HttpConfiguration
[ERROR] location: class org.apache.sling.distribution.transport.impl.SimpleHttpDistributionTransport
[ERROR] <https://builds.apache.org/job/sling-contrib-extensions-distribution-core-1.8/ws/src/main/java/org/apache/sling/distribution/packaging/impl/exporter/RemoteDistributionPackageExporter.java>:[52,84]
cannot find symbol
[ERROR] symbol:   class HttpConfiguration
[ERROR] location: class org.apache.sling.distribution.packaging.impl.exporter.RemoteDistributionPackageExporter
[ERROR] <https://builds.apache.org/job/sling-contrib-extensions-distribution-core-1.8/ws/src/main/java/org/apache/sling/distribution/agent/impl/ReverseDistributionAgentFactory.java>:[56,52]
cannot find symbol
[ERROR] symbol:   class HttpConfiguration
[ERROR] location: package org.apache.sling.distribution.transport.impl
[ERROR] <https://builds.apache.org/job/sling-contrib-extensions-distribution-core-1.8/ws/src/main/java/org/apache/sling/distribution/agent/impl/ForwardDistributionAgentFactory.java>:[250,9]
cannot find symbol
[ERROR] symbol:   class HttpConfiguration
[ERROR] location: class org.apache.sling.distribution.agent.impl.ForwardDistributionAgentFactory
[ERROR] <https://builds.apache.org/job/sling-contrib-extensions-distribution-core-1.8/ws/src/main/java/org/apache/sling/distribution/agent/impl/ForwardDistributionAgentFactory.java>:[250,51]
cannot find symbol
[ERROR] symbol:   class HttpConfiguration
[ERROR] location: class org.apache.sling.distribution.agent.impl.ForwardDistributionAgentFactory
[ERROR] <https://builds.apache.org/job/sling-contrib-extensions-distribution-core-1.8/ws/src/main/java/org/apache/sling/distribution/packaging/impl/exporter/RemoteDistributionPackageExporterFactory.java>:[112,9]
cannot find symbol
[ERROR] symbol:   class HttpConfiguration
[ERROR] location: class org.apache.sling.distribution.packaging.impl.exporter.RemoteDistributionPackageExporterFactory
[ERROR] <https://builds.apache.org/job/sling-contrib-extensions-distribution-core-1.8/ws/src/main/java/org/apache/sling/distribution/packaging/impl/exporter/RemoteDistributionPackageExporterFactory.java>:[112,51]
cannot find symbol
[ERROR] symbol:   class HttpConfiguration
[ERROR] location: class org.apache.sling.distribution.packaging.impl.exporter.RemoteDistributionPackageExporterFactory
[ERROR] <https://builds.apache.org/job/sling-contrib-extensions-distribution-core-1.8/ws/src/main/java/org/apache/sling/distribution/agent/impl/SyncDistributionAgentFactory.java>:[235,9]
cannot find symbol
[ERROR] symbol:   class HttpConfiguration
[ERROR] location: class org.apache.sling.distribution.agent.impl.SyncDistributionAgentFactory
[ERROR] <https://builds.apache.org/job/sling-contrib-extensions-distribution-core-1.8/ws/src/main/java/org/apache/sling/distribution/agent/impl/SyncDistributionAgentFactory.java>:[235,51]
cannot find symbol
[ERROR] symbol:   class HttpConfiguration
[ERROR] location: class org.apache.sling.distribution.agent.impl.SyncDistributionAgentFactory
[ERROR] <https://builds.apache.org/job/sling-contrib-extensions-distribution-core-1.8/ws/src/main/java/org/apache/sling/distribution/packaging/impl/importer/RemoteDistributionPackageImporterFactory.java>:[88,9]
cannot find symbol
[ERROR] symbol:   class HttpConfiguration
[ERROR] location: class org.apache.sling.distribution.packaging.impl.importer.RemoteDistributionPackageImporterFactory
[ERROR] <https://builds.apache.org/job/sling-contrib-extensions-distribution-core-1.8/ws/src/main/java/org/apache/sling/distribution/packaging/impl/importer/RemoteDistributionPackageImporterFactory.java>:[88,51]
cannot find symbol
[ERROR] symbol:   class HttpConfiguration
[ERROR] location: class org.apache.sling.distribution.packaging.impl.importer.RemoteDistributionPackageImporterFactory
[ERROR] <https://builds.apache.org/job/sling-contrib-extensions-distribution-core-1.8/ws/src/main/java/org/apache/sling/distribution/agent/impl/ReverseDistributionAgentFactory.java>:[198,9]
cannot find symbol
[ERROR] symbol:   class HttpConfiguration
[ERROR] location: class org.apache.sling.distribution.agent.impl.ReverseDistributionAgentFactory
[ERROR] <https://builds.apache.org/job/sling-contrib-extensions-distribution-core-1.8/ws/src/main/java/org/apache/sling/distribution/agent/impl/ReverseDistributionAgentFactory.java>:[198,51]
cannot find symbol
[ERROR] symbol:   class HttpConfiguration
[ERROR] location: class org.apache.sling.distribution.agent.impl.ReverseDistributionAgentFactory
[ERROR] -> [Help 1]
[ERROR] 
[ERROR] To see the full stack trace of the errors, re-run Maven with the -e switch.
[ERROR] Re-run Maven using the -X switch to enable full debug logging.
[ERROR] 
[ERROR] For more information about the errors and possible solutions, please read the following
articles:
[ERROR] [Help 1] http://cwiki.apache.org/confluence/display/MAVEN/MojoFailureException
channel stopped
Recording test results

Mime
View raw message