sling-commits mailing list archives

Site index · List index
Message view « Date » · « Thread »
Top « Date » · « Thread »
From Apache Jenkins Server <jenk...@builds.apache.org>
Subject Build failed in Jenkins: sling-bundles-extensions-healthcheck-api-1.7 #1
Date Tue, 11 Apr 2017 06:23:03 GMT
See <https://builds.apache.org/job/sling-bundles-extensions-healthcheck-api-1.7/1/display/redirect>

------------------------------------------
Started by an SCM change
[EnvInject] - Loading node environment variables.
Building remotely on qnode2 (ubuntu) in workspace <https://builds.apache.org/job/sling-bundles-extensions-healthcheck-api-1.7/ws/>
Checking out a fresh workspace because there's no workspace at <https://builds.apache.org/job/sling-bundles-extensions-healthcheck-api-1.7/ws/>
Cleaning local Directory .
Checking out https://svn.apache.org/repos/asf/sling/trunk/bundles/extensions/healthcheck/api
at revision '2017-04-11T06:22:49.451 +0000'
A         src
A         src/test
A         src/test/java
A         src/test/java/org
A         src/test/java/org/apache
A         src/test/java/org/apache/sling
A         src/test/java/org/apache/sling/hc
A         src/test/java/org/apache/sling/hc/util
AU        src/test/java/org/apache/sling/hc/util/SimpleConstraintCheckerTest.java
A         src/test/java/org/apache/sling/hc/api
AU        src/test/java/org/apache/sling/hc/api/ResultTest.java
A         src/test/java/org/apache/sling/hc/api/ResultLogTest.java
A         src/main
A         src/main/java
A         src/main/java/org
A         src/main/java/org/apache
A         src/main/java/org/apache/sling
A         src/main/java/org/apache/sling/hc
A         src/main/java/org/apache/sling/hc/util
A         src/main/java/org/apache/sling/hc/util/HealthCheckFilter.java
A         src/main/java/org/apache/sling/hc/util/FormattingResultLog.java
AU        src/main/java/org/apache/sling/hc/util/SimpleConstraintChecker.java
AU        src/main/java/org/apache/sling/hc/util/HealthCheckMetadata.java
A         src/main/java/org/apache/sling/hc/util/package-info.java
A         src/main/java/org/apache/sling/hc/api
AU        src/main/java/org/apache/sling/hc/api/Result.java
A         src/main/java/org/apache/sling/hc/api/ResultLog.java
AU        src/main/java/org/apache/sling/hc/api/HealthCheck.java
A         src/main/java/org/apache/sling/hc/api/execution
AU        src/main/java/org/apache/sling/hc/api/execution/package-info.java
AU        src/main/java/org/apache/sling/hc/api/execution/HealthCheckExecutionResult.java
AU        src/main/java/org/apache/sling/hc/api/execution/HealthCheckExecutor.java
A         src/main/java/org/apache/sling/hc/api/execution/HealthCheckExecutionOptions.java
A         src/main/java/org/apache/sling/hc/api/package-info.java
A         pom.xml
At revision 1790929

Parsing POMs
ERROR: Failed to parse POMs
java.io.IOException: remote file operation failed: <https://builds.apache.org/job/sling-bundles-extensions-healthcheck-api-1.7/ws/>
at hudson.remoting.Channel@5b57159c:qnode2: hudson.remoting.ProxyException: hudson.maven.MavenModuleSetBuild$MavenExecutionException:
org.apache.maven.project.ProjectBuildingException: Some problems were encountered while processing
the POMs:
[FATAL] Non-resolvable parent POM: Could not find artifact org.apache.sling:org.apache.sling.hc.reactor:pom:1.0.3-SNAPSHOT
and 'parent.relativePath' points at wrong local POM @ line 23, column 13

	at hudson.FilePath.act(FilePath.java:992)
	at hudson.FilePath.act(FilePath.java:974)
	at hudson.maven.MavenModuleSetBuild$MavenModuleSetBuildExecution.parsePoms(MavenModuleSetBuild.java:980)
	at hudson.maven.MavenModuleSetBuild$MavenModuleSetBuildExecution.doRun(MavenModuleSetBuild.java:692)
	at hudson.model.AbstractBuild$AbstractBuildExecution.run(AbstractBuild.java:534)
	at hudson.model.Run.execute(Run.java:1728)
	at hudson.maven.MavenModuleSetBuild.run(MavenModuleSetBuild.java:544)
	at hudson.model.ResourceController.execute(ResourceController.java:98)
	at hudson.model.Executor.run(Executor.java:404)
Caused by: hudson.remoting.ProxyException: hudson.maven.MavenModuleSetBuild$MavenExecutionException:
org.apache.maven.project.ProjectBuildingException: Some problems were encountered while processing
the POMs:
[FATAL] Non-resolvable parent POM: Could not find artifact org.apache.sling:org.apache.sling.hc.reactor:pom:1.0.3-SNAPSHOT
and 'parent.relativePath' points at wrong local POM @ line 23, column 13

	at hudson.maven.MavenModuleSetBuild$PomParser.invoke(MavenModuleSetBuild.java:1384)
	at hudson.maven.MavenModuleSetBuild$PomParser.invoke(MavenModuleSetBuild.java:1118)
	at hudson.FilePath$FileCallableWrapper.call(FilePath.java:2731)
	at hudson.remoting.UserRequest.perform(UserRequest.java:153)
	at hudson.remoting.UserRequest.perform(UserRequest.java:50)
	at hudson.remoting.Request$2.run(Request.java:336)
	at hudson.remoting.InterceptingExecutorService$1.call(InterceptingExecutorService.java:68)
	at java.util.concurrent.FutureTask.run(FutureTask.java:266)
	at java.util.concurrent.ThreadPoolExecutor.runWorker(ThreadPoolExecutor.java:1142)
	at java.util.concurrent.ThreadPoolExecutor$Worker.run(ThreadPoolExecutor.java:617)
	at java.lang.Thread.run(Thread.java:745)
	at ......remote call to qnode2(Native Method)
	at hudson.remoting.Channel.attachCallSiteStackTrace(Channel.java:1537)
	at hudson.remoting.UserResponse.retrieve(UserRequest.java:253)
	at hudson.remoting.Channel.call(Channel.java:822)
	at hudson.FilePath.act(FilePath.java:985)
	... 8 more
Caused by: hudson.remoting.ProxyException: org.apache.maven.project.ProjectBuildingException:
Some problems were encountered while processing the POMs:
[FATAL] Non-resolvable parent POM: Could not find artifact org.apache.sling:org.apache.sling.hc.reactor:pom:1.0.3-SNAPSHOT
and 'parent.relativePath' points at wrong local POM @ line 23, column 13

	at org.apache.maven.project.DefaultProjectBuilder.build(DefaultProjectBuilder.java:364)
	at hudson.maven.MavenEmbedder.buildProjects(MavenEmbedder.java:361)
	at hudson.maven.MavenEmbedder.readProjects(MavenEmbedder.java:331)
	at hudson.maven.MavenModuleSetBuild$PomParser.invoke(MavenModuleSetBuild.java:1321)
	at hudson.maven.MavenModuleSetBuild$PomParser.invoke(MavenModuleSetBuild.java:1118)
	at hudson.FilePath$FileCallableWrapper.call(FilePath.java:2731)
	at hudson.remoting.UserRequest.perform(UserRequest.java:153)
	at hudson.remoting.UserRequest.perform(UserRequest.java:50)
	at hudson.remoting.Request$2.run(Request.java:336)
	at hudson.remoting.InterceptingExecutorService$1.call(InterceptingExecutorService.java:68)
	at java.util.concurrent.FutureTask.run(FutureTask.java:266)
	at java.util.concurrent.ThreadPoolExecutor.runWorker(ThreadPoolExecutor.java:1142)
	at java.util.concurrent.ThreadPoolExecutor$Worker.run(ThreadPoolExecutor.java:617)
	at java.lang.Thread.run(Thread.java:745)
Recording test results

Mime
View raw message