sling-commits mailing list archives

Site index · List index
Message view « Date » · « Thread »
Top « Date » · « Thread »
From Apache Jenkins Server <jenk...@builds.apache.org>
Subject Build failed in Jenkins: sling-bundles-extensions-models-impl-1.7 #40
Date Thu, 27 Apr 2017 15:56:27 GMT
See <https://builds.apache.org/job/sling-bundles-extensions-models-impl-1.7/40/display/redirect?page=changes>

Changes:

[justin] [maven-release-plugin] prepare for next development iteration

[justin] [maven-release-plugin] prepare release org.apache.sling.models.impl-1.4.0

[justin] use released api

[justin] SLING-6785 - support caching for adaptations

------------------------------------------
Started by an SCM change
Started by upstream project "sling-bundles-extensions-models-api-1.7" build number 9
originally caused by:
 Started by an SCM change
Started by upstream project "sling-bundles-extensions-models-api-1.8" build number 9
originally caused by:
 Started by an SCM change
[EnvInject] - Loading node environment variables.
Building remotely on H24 (ubuntu xenial) in workspace <https://builds.apache.org/job/sling-bundles-extensions-models-impl-1.7/ws/>
Updating https://svn.apache.org/repos/asf/sling/trunk/bundles/extensions/models/impl at revision
'2017-04-27T15:54:51.891 +0000'
A         src/test/java/org/apache/sling/models/impl/CachingTest.java
A         src/test/java/org/apache/sling/models/testmodels/interfaces/CachedModel.java
A         src/test/java/org/apache/sling/models/testmodels/interfaces/UncachedModel.java
A         src/test/java/org/apache/sling/models/testmodels/classes/CachedModel.java
A         src/test/java/org/apache/sling/models/testmodels/classes/UncachedModel.java
U         src/main/java/org/apache/sling/models/impl/ModelAdapterFactory.java
U         pom.xml
At revision 1792912

Parsing POMs
Modules changed, recalculating dependency graph
Established TCP socket on 33624
maven33-agent.jar already up to date
maven33-interceptor.jar already up to date
maven3-interceptor-commons.jar already up to date
[sling-bundles-extensions-models-impl-1.7] $ /home/jenkins/tools/java/latest1.7/bin/java -Xmx2g
-Xms256m -cp /home/jenkins/jenkins-slave/maven33-agent.jar:/home/jenkins/tools/maven/apache-maven-3.3.9/boot/plexus-classworlds-2.5.2.jar:/home/jenkins/tools/maven/apache-maven-3.3.9/conf/logging
jenkins.maven3.agent.Maven33Main /home/jenkins/tools/maven/apache-maven-3.3.9 /home/jenkins/jenkins-slave/slave.jar
/home/jenkins/jenkins-slave/maven33-interceptor.jar /home/jenkins/jenkins-slave/maven3-interceptor-commons.jar
33624
<===[JENKINS REMOTING CAPACITY]===>   channel started
Executing Maven:  -B -f <https://builds.apache.org/job/sling-bundles-extensions-models-impl-1.7/ws/pom.xml>
-Dmaven.repo.local=/home/jenkins/jenkins-slave/maven-repositories/0 -U clean deploy
[INFO] Scanning for projects...
[INFO]                                                                         
[INFO] ------------------------------------------------------------------------
[INFO] Building Apache Sling Models Implementation 1.4.1-SNAPSHOT
[INFO] ------------------------------------------------------------------------
[INFO] Downloading: https://repo.maven.apache.org/maven2/org/apache/sling/org.apache.sling.models.api/1.3.4/org.apache.sling.models.api-1.3.4.pom
[WARNING] The POM for org.apache.sling:org.apache.sling.models.api:jar:1.3.4 is missing, no
dependency information available
[INFO] Downloading: https://repo.maven.apache.org/maven2/org/apache/sling/org.apache.sling.testing.osgi-mock/1.5.0/org.apache.sling.testing.osgi-mock-1.5.0.pom
[INFO] Downloaded: https://repo.maven.apache.org/maven2/org/apache/sling/org.apache.sling.testing.osgi-mock/1.5.0/org.apache.sling.testing.osgi-mock-1.5.0.pom
(6 KB at 79.5 KB/sec)
[INFO] Downloading: https://repo.maven.apache.org/maven2/org/hamcrest/hamcrest-junit/2.0.0.0/hamcrest-junit-2.0.0.0.pom
[INFO] Downloaded: https://repo.maven.apache.org/maven2/org/hamcrest/hamcrest-junit/2.0.0.0/hamcrest-junit-2.0.0.0.pom
(2 KB at 67.7 KB/sec)
[INFO] Downloading: https://repo.maven.apache.org/maven2/org/apache/sling/org.apache.sling.scripting.core/2.0.20/org.apache.sling.scripting.core-2.0.20.pom
[INFO] Downloaded: https://repo.maven.apache.org/maven2/org/apache/sling/org.apache.sling.scripting.core/2.0.20/org.apache.sling.scripting.core-2.0.20.pom
(6 KB at 34.7 KB/sec)
[INFO] Downloading: https://repo.maven.apache.org/maven2/org/apache/sling/org.apache.sling.models.api/1.3.4/org.apache.sling.models.api-1.3.4.jar
[INFO] Downloading: https://repo.maven.apache.org/maven2/org/apache/sling/org.apache.sling.testing.osgi-mock/1.5.0/org.apache.sling.testing.osgi-mock-1.5.0.jar
[INFO] Downloading: https://repo.maven.apache.org/maven2/org/hamcrest/hamcrest-junit/2.0.0.0/hamcrest-junit-2.0.0.0.jar
[INFO] Downloading: https://repo.maven.apache.org/maven2/org/apache/sling/org.apache.sling.scripting.core/2.0.20/org.apache.sling.scripting.core-2.0.20.jar
[INFO] Downloaded: https://repo.maven.apache.org/maven2/org/hamcrest/hamcrest-junit/2.0.0.0/hamcrest-junit-2.0.0.0.jar
(15 KB at 162.9 KB/sec)
[INFO] Downloaded: https://repo.maven.apache.org/maven2/org/apache/sling/org.apache.sling.testing.osgi-mock/1.5.0/org.apache.sling.testing.osgi-mock-1.5.0.jar
(60 KB at 604.2 KB/sec)
[INFO] Downloaded: https://repo.maven.apache.org/maven2/org/apache/sling/org.apache.sling.scripting.core/2.0.20/org.apache.sling.scripting.core-2.0.20.jar
(55 KB at 219.8 KB/sec)
[JENKINS] Archiving disabled
[JENKINS] Archiving disabled[INFO] ------------------------------------------------------------------------
[INFO] BUILD FAILURE
[INFO] ------------------------------------------------------------------------
[INFO] Total time: 19.598 s
[INFO] Finished at: 2017-04-27T15:56:15+00:00

[INFO] Final Memory: 16M/246M
[INFO] ------------------------------------------------------------------------
Waiting for Jenkins to finish collecting data
[ERROR] Failed to execute goal on project org.apache.sling.models.impl: Could not resolve
dependencies for project org.apache.sling:org.apache.sling.models.impl:bundle:1.4.1-SNAPSHOT:
Could not find artifact org.apache.sling:org.apache.sling.models.api:jar:1.3.4 in central
(https://repo.maven.apache.org/maven2) -> [Help 1]
[ERROR] 
[ERROR] To see the full stack trace of the errors, re-run Maven with the -e switch.
[ERROR] Re-run Maven using the -X switch to enable full debug logging.
[ERROR] 
[ERROR] For more information about the errors and possible solutions, please read the following
articles:
[ERROR] [Help 1] http://cwiki.apache.org/confluence/display/MAVEN/DependencyResolutionException
channel stopped
Recording test results
ERROR: Step ?Publish JUnit test result report? failed: Test reports were found but none of
them are new. Did tests run? 
For example, <https://builds.apache.org/job/sling-bundles-extensions-models-impl-1.7/ws/target/surefire-reports/TEST-org.apache.sling.models.impl.AdapterFactoryTest.xml>
is 7 days 0 hr old



Mime
View raw message