sling-commits mailing list archives

Site index · List index
Message view « Date » · « Thread »
Top « Date » · « Thread »
From Apache Jenkins Server <jenk...@builds.apache.org>
Subject Build failed in Jenkins: sling-bundles-scripting-sightly-testing-content-1.7 #42
Date Mon, 06 Mar 2017 10:58:08 GMT
See <https://builds.apache.org/job/sling-bundles-scripting-sightly-testing-content-1.7/42/display/redirect>

------------------------------------------
Started by upstream project "sling-bundles-scripting-sightly-engine-1.7" build number 48
originally caused by:
 Started by an SCM change
[EnvInject] - Loading node environment variables.
Building remotely on H14 (ubuntu) in workspace <https://builds.apache.org/job/sling-bundles-scripting-sightly-testing-content-1.7/ws/>
Updating https://svn.apache.org/repos/asf/sling/trunk/bundles/scripting/sightly/testing-content
at revision '2017-03-06T10:57:32.724 +0000'
U         pom.xml
At revision 1785628

No changes for https://svn.apache.org/repos/asf/sling/trunk/bundles/scripting/sightly/testing-content
since the previous build
Parsing POMs
Established TCP socket on 39433
maven33-agent.jar already up to date
maven33-interceptor.jar already up to date
maven3-interceptor-commons.jar already up to date
[sling-bundles-scripting-sightly-testing-content-1.7] $ /home/jenkins/tools/java/latest1.7/bin/java
-Xmx2g -Xms256m -cp /home/jenkins/jenkins-slave/maven33-agent.jar:/home/jenkins/tools/maven/apache-maven-3.3.9/boot/plexus-classworlds-2.5.2.jar:/home/jenkins/tools/maven/apache-maven-3.3.9/conf/logging
jenkins.maven3.agent.Maven33Main /home/jenkins/tools/maven/apache-maven-3.3.9 /home/jenkins/jenkins-slave/slave.jar
/home/jenkins/jenkins-slave/maven33-interceptor.jar /home/jenkins/jenkins-slave/maven3-interceptor-commons.jar
39433
<===[JENKINS REMOTING CAPACITY]===>   channel started
Executing Maven:  -B -f <https://builds.apache.org/job/sling-bundles-scripting-sightly-testing-content-1.7/ws/pom.xml>
-Dmaven.repo.local=/home/jenkins/jenkins-slave/maven-repositories/0 -U clean deploy
[INFO] Scanning for projects...
[INFO]                                                                         
[INFO] ------------------------------------------------------------------------
[INFO] Building Apache Sling Scripting HTL Integration Tests Content 1.0.7-SNAPSHOT
[INFO] ------------------------------------------------------------------------
[INFO] Downloading: https://repo.maven.apache.org/maven2/org/apache/felix/maven-scr-plugin/1.23.0/maven-scr-plugin-1.23.0.pom
[INFO] Downloaded: https://repo.maven.apache.org/maven2/org/apache/felix/maven-scr-plugin/1.23.0/maven-scr-plugin-1.23.0.pom
(4 KB at 8.7 KB/sec)
[INFO] Downloading: https://repo.maven.apache.org/maven2/org/apache/felix/maven-scr-plugin/1.23.0/maven-scr-plugin-1.23.0.jar
[INFO] Downloaded: https://repo.maven.apache.org/maven2/org/apache/felix/maven-scr-plugin/1.23.0/maven-scr-plugin-1.23.0.jar
(31 KB at 540.4 KB/sec)
[INFO] 
[INFO] --- maven-clean-plugin:3.0.0:clean (default-clean) @ org.apache.sling.scripting.sightly.testing-content
---
[INFO] Deleting <https://builds.apache.org/job/sling-bundles-scripting-sightly-testing-content-1.7/ws/target>
[INFO] 
[INFO] --- maven-enforcer-plugin:1.4.1:enforce (enforce-java) @ org.apache.sling.scripting.sightly.testing-content
---
[INFO] 
[INFO] --- maven-antrun-plugin:1.8:run (set-bundle-required-execution-environment) @ org.apache.sling.scripting.sightly.testing-content
---
[INFO] Executing tasks

main:
Setting Bundle-RequiredExecutionEnvironment=JavaSE-1.7 from sling.java.version=7
[INFO] Executed tasks
[INFO] 
[INFO] --- jslint-maven-plugin:1.0.1:jslint (default) @ org.apache.sling.scripting.sightly.testing-content
---
[INFO] Parsing: sightlytck.json
[INFO] Parsing: sightlyperf.json
[INFO] Parsing: sightly.json
[INFO] Parsing: apps/sightly/locales/de_ch.json
[INFO] Parsing: apps/sightly/locales/de_finance_basename.json
[INFO] Parsing: apps/sightly/locales/de.json
[INFO] Parsing: apps/sightly/scripts/useinheritance.json
[INFO] 
[INFO] --- maven-remote-resources-plugin:1.5:process (process-resource-bundles) @ org.apache.sling.scripting.sightly.testing-content
---
[INFO] 
[INFO] --- maven-remote-resources-plugin:1.5:process (default) @ org.apache.sling.scripting.sightly.testing-content
---
[INFO] 
[INFO] --- maven-dependency-plugin:2.10:unpack (unpack) @ org.apache.sling.scripting.sightly.testing-content
---
[INFO] Configured Artifact: io.sightly:io.sightly.tck:1.3.1:jar
[INFO] Unpacking /home/jenkins/jenkins-slave/maven-repositories/0/io/sightly/io.sightly.tck/1.3.1/io.sightly.tck-1.3.1.jar
to <https://builds.apache.org/job/sling-bundles-scripting-sightly-testing-content-1.7/ws/target/sightlytck>
with includes "**/*.html,**/*.js,**/*.java" and excludes ""
[INFO] 
[INFO] --- maven-resources-plugin:2.7:copy-resources (copy-resources) @ org.apache.sling.scripting.sightly.testing-content
---
[INFO] Using 'UTF-8' encoding to copy filtered resources.
[INFO] Copying 31 resources
[INFO] 
[INFO] --- maven-resources-plugin:2.7:resources (default-resources) @ org.apache.sling.scripting.sightly.testing-content
---
[INFO] Using 'UTF-8' encoding to copy filtered resources.
[INFO] Copying 86 resources
[INFO] Copying 31 resources to SLING-INF/sightlytck
[INFO] Copying 3 resources
[INFO] Copying 3 resources
[INFO] 
[INFO] --- maven-compiler-plugin:3.5.1:compile (default-compile) @ org.apache.sling.scripting.sightly.testing-content
---
[INFO] Changes detected - recompiling the module!
[INFO] Compiling 15 source files to <https://builds.apache.org/job/sling-bundles-scripting-sightly-testing-content-1.7/ws/target/classes>
[INFO] <https://builds.apache.org/job/sling-bundles-scripting-sightly-testing-content-1.7/ws/src/main/java/org/apache/sling/scripting/sightly/testing/adaptable/impl/RequestAdapterFactory.java>:
Some input files use unchecked or unsafe operations.
[INFO] <https://builds.apache.org/job/sling-bundles-scripting-sightly-testing-content-1.7/ws/src/main/java/org/apache/sling/scripting/sightly/testing/adaptable/impl/RequestAdapterFactory.java>:
Recompile with -Xlint:unchecked for details.
[INFO] -------------------------------------------------------------
[ERROR] COMPILATION ERROR : 
[INFO] -------------------------------------------------------------
[ERROR] <https://builds.apache.org/job/sling-bundles-scripting-sightly-testing-content-1.7/ws/src/main/java/org/apache/sling/scripting/sightly/testing/adaptable/impl/RequestAdapterFactory.java>:[21,40]
package org.apache.felix.scr.annotations does not exist
[ERROR] <https://builds.apache.org/job/sling-bundles-scripting-sightly-testing-content-1.7/ws/src/main/java/org/apache/sling/scripting/sightly/testing/adaptable/impl/RequestAdapterFactory.java>:[22,40]
package org.apache.felix.scr.annotations does not exist
[ERROR] <https://builds.apache.org/job/sling-bundles-scripting-sightly-testing-content-1.7/ws/src/main/java/org/apache/sling/scripting/sightly/testing/adaptable/impl/RequestAdapterFactory.java>:[23,40]
package org.apache.felix.scr.annotations does not exist
[ERROR] <https://builds.apache.org/job/sling-bundles-scripting-sightly-testing-content-1.7/ws/src/main/java/org/apache/sling/scripting/sightly/testing/adaptable/impl/RequestAdapterFactory.java>:[24,40]
package org.apache.felix.scr.annotations does not exist
[ERROR] <https://builds.apache.org/job/sling-bundles-scripting-sightly-testing-content-1.7/ws/src/main/java/org/apache/sling/scripting/sightly/testing/adaptable/impl/RequestAdapterFactory.java>:[31,2]
cannot find symbol
  symbol: class Component
[ERROR] <https://builds.apache.org/job/sling-bundles-scripting-sightly-testing-content-1.7/ws/src/main/java/org/apache/sling/scripting/sightly/testing/adaptable/impl/RequestAdapterFactory.java>:[32,2]
cannot find symbol
  symbol: class Service
[ERROR] <https://builds.apache.org/job/sling-bundles-scripting-sightly-testing-content-1.7/ws/src/main/java/org/apache/sling/scripting/sightly/testing/adaptable/impl/RequestAdapterFactory.java>:[33,2]
cannot find symbol
  symbol: class Properties
[ERROR] <https://builds.apache.org/job/sling-bundles-scripting-sightly-testing-content-1.7/ws/src/main/java/org/apache/sling/scripting/sightly/testing/use/impl/TestServiceImpl.java>:[19,40]
package org.apache.felix.scr.annotations does not exist
[ERROR] <https://builds.apache.org/job/sling-bundles-scripting-sightly-testing-content-1.7/ws/src/main/java/org/apache/sling/scripting/sightly/testing/use/impl/TestServiceImpl.java>:[20,40]
package org.apache.felix.scr.annotations does not exist
[ERROR] <https://builds.apache.org/job/sling-bundles-scripting-sightly-testing-content-1.7/ws/src/main/java/org/apache/sling/scripting/sightly/testing/use/impl/TestServiceImpl.java>:[23,2]
cannot find symbol
  symbol: class Component
[ERROR] <https://builds.apache.org/job/sling-bundles-scripting-sightly-testing-content-1.7/ws/src/main/java/org/apache/sling/scripting/sightly/testing/use/impl/TestServiceImpl.java>:[24,2]
cannot find symbol
  symbol: class Service
[ERROR] <https://builds.apache.org/job/sling-bundles-scripting-sightly-testing-content-1.7/ws/src/main/java/org/apache/sling/scripting/sightly/testing/adaptable/impl/ResourceAdapterFactory.java>:[21,40]
package org.apache.felix.scr.annotations does not exist
[ERROR] <https://builds.apache.org/job/sling-bundles-scripting-sightly-testing-content-1.7/ws/src/main/java/org/apache/sling/scripting/sightly/testing/adaptable/impl/ResourceAdapterFactory.java>:[22,40]
package org.apache.felix.scr.annotations does not exist
[ERROR] <https://builds.apache.org/job/sling-bundles-scripting-sightly-testing-content-1.7/ws/src/main/java/org/apache/sling/scripting/sightly/testing/adaptable/impl/ResourceAdapterFactory.java>:[23,40]
package org.apache.felix.scr.annotations does not exist
[ERROR] <https://builds.apache.org/job/sling-bundles-scripting-sightly-testing-content-1.7/ws/src/main/java/org/apache/sling/scripting/sightly/testing/adaptable/impl/ResourceAdapterFactory.java>:[24,40]
package org.apache.felix.scr.annotations does not exist
[ERROR] <https://builds.apache.org/job/sling-bundles-scripting-sightly-testing-content-1.7/ws/src/main/java/org/apache/sling/scripting/sightly/testing/adaptable/impl/ResourceAdapterFactory.java>:[30,2]
cannot find symbol
  symbol: class Component
[ERROR] <https://builds.apache.org/job/sling-bundles-scripting-sightly-testing-content-1.7/ws/src/main/java/org/apache/sling/scripting/sightly/testing/adaptable/impl/ResourceAdapterFactory.java>:[31,2]
cannot find symbol
  symbol: class Service
[ERROR] <https://builds.apache.org/job/sling-bundles-scripting-sightly-testing-content-1.7/ws/src/main/java/org/apache/sling/scripting/sightly/testing/adaptable/impl/ResourceAdapterFactory.java>:[32,2]
cannot find symbol
  symbol: class Properties
[INFO] 18 errors 
[INFO] -------------------------------------------------------------
[JENKINS] Archiving disabled
[JENKINS] Archiving disabled[INFO] ------------------------------------------------------------------------
[INFO] BUILD FAILURE
[INFO] ------------------------------------------------------------------------
[INFO] Total time: 17.037 s
[INFO] Finished at: 2017-03-06T10:58:06+00:00

[INFO] Final Memory: 33M/322M
[INFO] ------------------------------------------------------------------------
Waiting for Jenkins to finish collecting data
[ERROR] Failed to execute goal org.apache.maven.plugins:maven-compiler-plugin:3.5.1:compile
(default-compile) on project org.apache.sling.scripting.sightly.testing-content: Compilation
failure: Compilation failure:
[ERROR] <https://builds.apache.org/job/sling-bundles-scripting-sightly-testing-content-1.7/ws/src/main/java/org/apache/sling/scripting/sightly/testing/adaptable/impl/RequestAdapterFactory.java>:[21,40]
package org.apache.felix.scr.annotations does not exist
[ERROR] <https://builds.apache.org/job/sling-bundles-scripting-sightly-testing-content-1.7/ws/src/main/java/org/apache/sling/scripting/sightly/testing/adaptable/impl/RequestAdapterFactory.java>:[22,40]
package org.apache.felix.scr.annotations does not exist
[ERROR] <https://builds.apache.org/job/sling-bundles-scripting-sightly-testing-content-1.7/ws/src/main/java/org/apache/sling/scripting/sightly/testing/adaptable/impl/RequestAdapterFactory.java>:[23,40]
package org.apache.felix.scr.annotations does not exist
[ERROR] <https://builds.apache.org/job/sling-bundles-scripting-sightly-testing-content-1.7/ws/src/main/java/org/apache/sling/scripting/sightly/testing/adaptable/impl/RequestAdapterFactory.java>:[24,40]
package org.apache.felix.scr.annotations does not exist
[ERROR] <https://builds.apache.org/job/sling-bundles-scripting-sightly-testing-content-1.7/ws/src/main/java/org/apache/sling/scripting/sightly/testing/adaptable/impl/RequestAdapterFactory.java>:[31,2]
cannot find symbol
[ERROR] symbol: class Component
[ERROR] <https://builds.apache.org/job/sling-bundles-scripting-sightly-testing-content-1.7/ws/src/main/java/org/apache/sling/scripting/sightly/testing/adaptable/impl/RequestAdapterFactory.java>:[32,2]
cannot find symbol
[ERROR] symbol: class Service
[ERROR] <https://builds.apache.org/job/sling-bundles-scripting-sightly-testing-content-1.7/ws/src/main/java/org/apache/sling/scripting/sightly/testing/adaptable/impl/RequestAdapterFactory.java>:[33,2]
cannot find symbol
[ERROR] symbol: class Properties
[ERROR] <https://builds.apache.org/job/sling-bundles-scripting-sightly-testing-content-1.7/ws/src/main/java/org/apache/sling/scripting/sightly/testing/use/impl/TestServiceImpl.java>:[19,40]
package org.apache.felix.scr.annotations does not exist
[ERROR] <https://builds.apache.org/job/sling-bundles-scripting-sightly-testing-content-1.7/ws/src/main/java/org/apache/sling/scripting/sightly/testing/use/impl/TestServiceImpl.java>:[20,40]
package org.apache.felix.scr.annotations does not exist
[ERROR] <https://builds.apache.org/job/sling-bundles-scripting-sightly-testing-content-1.7/ws/src/main/java/org/apache/sling/scripting/sightly/testing/use/impl/TestServiceImpl.java>:[23,2]
cannot find symbol
[ERROR] symbol: class Component
[ERROR] <https://builds.apache.org/job/sling-bundles-scripting-sightly-testing-content-1.7/ws/src/main/java/org/apache/sling/scripting/sightly/testing/use/impl/TestServiceImpl.java>:[24,2]
cannot find symbol
[ERROR] symbol: class Service
[ERROR] <https://builds.apache.org/job/sling-bundles-scripting-sightly-testing-content-1.7/ws/src/main/java/org/apache/sling/scripting/sightly/testing/adaptable/impl/ResourceAdapterFactory.java>:[21,40]
package org.apache.felix.scr.annotations does not exist
[ERROR] <https://builds.apache.org/job/sling-bundles-scripting-sightly-testing-content-1.7/ws/src/main/java/org/apache/sling/scripting/sightly/testing/adaptable/impl/ResourceAdapterFactory.java>:[22,40]
package org.apache.felix.scr.annotations does not exist
[ERROR] <https://builds.apache.org/job/sling-bundles-scripting-sightly-testing-content-1.7/ws/src/main/java/org/apache/sling/scripting/sightly/testing/adaptable/impl/ResourceAdapterFactory.java>:[23,40]
package org.apache.felix.scr.annotations does not exist
[ERROR] <https://builds.apache.org/job/sling-bundles-scripting-sightly-testing-content-1.7/ws/src/main/java/org/apache/sling/scripting/sightly/testing/adaptable/impl/ResourceAdapterFactory.java>:[24,40]
package org.apache.felix.scr.annotations does not exist
[ERROR] <https://builds.apache.org/job/sling-bundles-scripting-sightly-testing-content-1.7/ws/src/main/java/org/apache/sling/scripting/sightly/testing/adaptable/impl/ResourceAdapterFactory.java>:[30,2]
cannot find symbol
[ERROR] symbol: class Component
[ERROR] <https://builds.apache.org/job/sling-bundles-scripting-sightly-testing-content-1.7/ws/src/main/java/org/apache/sling/scripting/sightly/testing/adaptable/impl/ResourceAdapterFactory.java>:[31,2]
cannot find symbol
[ERROR] symbol: class Service
[ERROR] <https://builds.apache.org/job/sling-bundles-scripting-sightly-testing-content-1.7/ws/src/main/java/org/apache/sling/scripting/sightly/testing/adaptable/impl/ResourceAdapterFactory.java>:[32,2]
cannot find symbol
[ERROR] symbol: class Properties
[ERROR] -> [Help 1]
[ERROR] 
[ERROR] To see the full stack trace of the errors, re-run Maven with the -e switch.
[ERROR] Re-run Maven using the -X switch to enable full debug logging.
[ERROR] 
[ERROR] For more information about the errors and possible solutions, please read the following
articles:
[ERROR] [Help 1] http://cwiki.apache.org/confluence/display/MAVEN/MojoFailureException
channel stopped
Recording test results

Mime
View raw message