sling-commits mailing list archives

Site index · List index
Message view « Date » · « Thread »
Top « Date » · « Thread »
From Apache Jenkins Server <jenk...@builds.apache.org>
Subject Build failed in Jenkins: sling-contrib-commons-mom-jobs-core-1.7 #6
Date Mon, 06 Mar 2017 10:24:32 GMT
See <https://builds.apache.org/job/sling-contrib-commons-mom-jobs-core-1.7/6/display/redirect?page=changes>

Changes:

[olli] use Sling Parent 30

------------------------------------------
Started by an SCM change
[EnvInject] - Loading node environment variables.
Building remotely on ubuntu-4 (ubuntu) in workspace <https://builds.apache.org/job/sling-contrib-commons-mom-jobs-core-1.7/ws/>
Checking out a fresh workspace because there's no workspace at <https://builds.apache.org/job/sling-contrib-commons-mom-jobs-core-1.7/ws/>
Cleaning local Directory .
Checking out https://svn.apache.org/repos/asf/sling/trunk/contrib/commons/mom/jobs/core at
revision '2017-03-06T10:24:24.764 +0000'
A         src
A         src/main
A         src/main/java
A         src/main/java/org
A         src/main/java/org/apache
A         src/main/java/org/apache/sling
A         src/main/java/org/apache/sling/jobs
AU        src/main/java/org/apache/sling/jobs/JobCallback.java
AU        src/main/java/org/apache/sling/jobs/Job.java
AU        src/main/java/org/apache/sling/jobs/JobTypeValve.java
AU        src/main/java/org/apache/sling/jobs/JobUpdate.java
AU        src/main/java/org/apache/sling/jobs/JobController.java
AU        src/main/java/org/apache/sling/jobs/JobBuilder.java
A         src/main/java/org/apache/sling/jobs/impl
AU        src/main/java/org/apache/sling/jobs/impl/JobSubsystem.java
A         src/main/java/org/apache/sling/jobs/impl/spi
AU        src/main/java/org/apache/sling/jobs/impl/spi/JobStarter.java
AU        src/main/java/org/apache/sling/jobs/impl/spi/JobStorage.java
AU        src/main/java/org/apache/sling/jobs/impl/spi/MapValueAdapter.java
AU        src/main/java/org/apache/sling/jobs/impl/JobImpl.java
AU        src/main/java/org/apache/sling/jobs/impl/ManagerSubscriber.java
AU        src/main/java/org/apache/sling/jobs/impl/JobUpdateImpl.java
AU        src/main/java/org/apache/sling/jobs/impl/Utils.java
AU        src/main/java/org/apache/sling/jobs/impl/JobBuilderImpl.java
AU        src/main/java/org/apache/sling/jobs/impl/JobQueueConsumerFactory.java
AU        src/main/java/org/apache/sling/jobs/impl/OutboundJobUpdateListener.java
A         src/main/java/org/apache/sling/jobs/impl/storage
AU        src/main/java/org/apache/sling/jobs/impl/storage/InMemoryJobStorage.java
AU        src/main/java/org/apache/sling/jobs/impl/JobUpdateBuilderImpl.java
AU        src/main/java/org/apache/sling/jobs/impl/JobManagerImpl.java
AU        src/main/java/org/apache/sling/jobs/JobUpdateListener.java
AU        src/main/java/org/apache/sling/jobs/JobUpdateBuilder.java
AU        src/main/java/org/apache/sling/jobs/Types.java
AU        src/main/java/org/apache/sling/jobs/package-info.java
AU        src/main/java/org/apache/sling/jobs/JobManager.java
AU        src/main/java/org/apache/sling/jobs/JobConsumer.java
A         src/test
A         src/test/java
A         src/test/java/org
A         src/test/java/org/apache
A         src/test/java/org/apache/sling
A         src/test/java/org/apache/sling/jobs
A         src/test/java/org/apache/sling/jobs/impl
AU        src/test/java/org/apache/sling/jobs/impl/JobImplTest.java
AU        src/test/java/org/apache/sling/jobs/impl/ManagerSubscriberTest.java
AU        src/test/java/org/apache/sling/jobs/impl/JobUpdateImplTest.java
AU        src/test/java/org/apache/sling/jobs/impl/UtilsTest.java
AU        src/test/java/org/apache/sling/jobs/impl/JobBuilderImplTest.java
A         src/test/java/org/apache/sling/jobs/impl/storage
AU        src/test/java/org/apache/sling/jobs/impl/storage/InMemoryJobStorageTest.java
AU        src/test/java/org/apache/sling/jobs/impl/QueueEntry.java
AU        src/test/java/org/apache/sling/jobs/impl/JobManagerImplTest.java
AU        pom.xml
AU        README.md
 U        .
At revision 1785621

Parsing POMs
Failed to transfer Could not find artifact org.apache.sling:sling:pom:30 in central (http://repo.maven.apache.org/maven2)
ERROR: Failed to parse POMs
java.io.IOException: remote file operation failed: <https://builds.apache.org/job/sling-contrib-commons-mom-jobs-core-1.7/ws/>
at hudson.remoting.Channel@64dbb9f5:ubuntu-4: hudson.remoting.ProxyException: hudson.maven.MavenModuleSetBuild$MavenExecutionException:
org.apache.maven.project.ProjectBuildingException: Some problems were encountered while processing
the POMs:
[FATAL] Non-resolvable parent POM: Could not find artifact org.apache.sling:sling:pom:30 in
central (http://repo.maven.apache.org/maven2) and 'parent.relativePath' points at no local
POM @ line 22, column 13

	at hudson.FilePath.act(FilePath.java:992)
	at hudson.FilePath.act(FilePath.java:974)
	at hudson.maven.MavenModuleSetBuild$MavenModuleSetBuildExecution.parsePoms(MavenModuleSetBuild.java:980)
	at hudson.maven.MavenModuleSetBuild$MavenModuleSetBuildExecution.doRun(MavenModuleSetBuild.java:692)
	at hudson.model.AbstractBuild$AbstractBuildExecution.run(AbstractBuild.java:534)
	at hudson.model.Run.execute(Run.java:1728)
	at hudson.maven.MavenModuleSetBuild.run(MavenModuleSetBuild.java:544)
	at hudson.model.ResourceController.execute(ResourceController.java:98)
	at hudson.model.Executor.run(Executor.java:404)
Caused by: hudson.remoting.ProxyException: hudson.maven.MavenModuleSetBuild$MavenExecutionException:
org.apache.maven.project.ProjectBuildingException: Some problems were encountered while processing
the POMs:
[FATAL] Non-resolvable parent POM: Could not find artifact org.apache.sling:sling:pom:30 in
central (http://repo.maven.apache.org/maven2) and 'parent.relativePath' points at no local
POM @ line 22, column 13

	at hudson.maven.MavenModuleSetBuild$PomParser.invoke(MavenModuleSetBuild.java:1384)
	at hudson.maven.MavenModuleSetBuild$PomParser.invoke(MavenModuleSetBuild.java:1118)
	at hudson.FilePath$FileCallableWrapper.call(FilePath.java:2731)
	at hudson.remoting.UserRequest.perform(UserRequest.java:153)
	at hudson.remoting.UserRequest.perform(UserRequest.java:50)
	at hudson.remoting.Request$2.run(Request.java:336)
	at hudson.remoting.InterceptingExecutorService$1.call(InterceptingExecutorService.java:68)
	at java.util.concurrent.FutureTask.run(FutureTask.java:262)
	at java.util.concurrent.ThreadPoolExecutor.runWorker(ThreadPoolExecutor.java:1145)
	at java.util.concurrent.ThreadPoolExecutor$Worker.run(ThreadPoolExecutor.java:615)
	at java.lang.Thread.run(Thread.java:745)
	at ......remote call to ubuntu-4(Native Method)
	at hudson.remoting.Channel.attachCallSiteStackTrace(Channel.java:1537)
	at hudson.remoting.UserResponse.retrieve(UserRequest.java:253)
	at hudson.remoting.Channel.call(Channel.java:822)
	at hudson.FilePath.act(FilePath.java:985)
	... 8 more
Caused by: hudson.remoting.ProxyException: org.apache.maven.project.ProjectBuildingException:
Some problems were encountered while processing the POMs:
[FATAL] Non-resolvable parent POM: Could not find artifact org.apache.sling:sling:pom:30 in
central (http://repo.maven.apache.org/maven2) and 'parent.relativePath' points at no local
POM @ line 22, column 13

	at org.apache.maven.project.DefaultProjectBuilder.build(DefaultProjectBuilder.java:364)
	at hudson.maven.MavenEmbedder.buildProjects(MavenEmbedder.java:361)
	at hudson.maven.MavenEmbedder.readProjects(MavenEmbedder.java:331)
	at hudson.maven.MavenModuleSetBuild$PomParser.invoke(MavenModuleSetBuild.java:1321)
	at hudson.maven.MavenModuleSetBuild$PomParser.invoke(MavenModuleSetBuild.java:1118)
	at hudson.FilePath$FileCallableWrapper.call(FilePath.java:2731)
	at hudson.remoting.UserRequest.perform(UserRequest.java:153)
	at hudson.remoting.UserRequest.perform(UserRequest.java:50)
	at hudson.remoting.Request$2.run(Request.java:336)
	at hudson.remoting.InterceptingExecutorService$1.call(InterceptingExecutorService.java:68)
	at java.util.concurrent.FutureTask.run(FutureTask.java:262)
	at java.util.concurrent.ThreadPoolExecutor.runWorker(ThreadPoolExecutor.java:1145)
	at java.util.concurrent.ThreadPoolExecutor$Worker.run(ThreadPoolExecutor.java:615)
	at java.lang.Thread.run(Thread.java:745)
Recording test results

Mime
View raw message