sling-commits mailing list archives

Site index · List index
Message view « Date » · « Thread »
Top « Date » · « Thread »
From Apache Jenkins Server <jenk...@builds.apache.org>
Subject Build failed in Jenkins: sling-tooling-support-provisioning-model-1.7 #16
Date Mon, 06 Mar 2017 10:29:53 GMT
See <https://builds.apache.org/job/sling-tooling-support-provisioning-model-1.7/16/display/redirect?page=changes>

Changes:

[olli] use Sling Parent 30

------------------------------------------
Started by an SCM change
[EnvInject] - Loading node environment variables.
Building remotely on ubuntu-4 (ubuntu) in workspace <https://builds.apache.org/job/sling-tooling-support-provisioning-model-1.7/ws/>
Checking out a fresh workspace because there's no workspace at <https://builds.apache.org/job/sling-tooling-support-provisioning-model-1.7/ws/>
Cleaning local Directory .
Checking out https://svn.apache.org/repos/asf/sling/trunk/tooling/support/provisioning-model
at revision '2017-03-06T10:29:41.646 +0000'
A         src
A         src/test
A         src/test/resources
AU        src/test/resources/configadmin.txt
A         src/test/resources/merge
AU        src/test/resources/merge/config-merge.txt
AU        src/test/resources/merge/startlevel-merge.txt
AU        src/test/resources/merge/remove-special-base.txt
AU        src/test/resources/merge/artifact-base.txt
AU        src/test/resources/merge/remove-base.txt
AU        src/test/resources/merge/remove-special-merge.txt
AU        src/test/resources/merge/artifact-merge.txt
AU        src/test/resources/merge/remove-merge.txt
AU        src/test/resources/merge/artifact-merge2.txt
AU        src/test/resources/merge/config-base.txt
AU        src/test/resources/merge/startlevel-base.txt
AU        src/test/resources/boot.txt
AU        src/test/resources/main.txt
AU        src/test/resources/additional.txt
AU        src/test/resources/oak.txt
AU        src/test/resources/example.txt
AU        src/test/resources/feature.txt
A         src/test/java
A         src/test/java/org
A         src/test/java/org/apache
A         src/test/java/org/apache/sling
A         src/test/java/org/apache/sling/provisioning
A         src/test/java/org/apache/sling/provisioning/model
AU        src/test/java/org/apache/sling/provisioning/model/ModelUtilityTest.java
A         src/test/java/org/apache/sling/provisioning/model/U.java
AU        src/test/java/org/apache/sling/provisioning/model/VersionTest.java
A         src/test/java/org/apache/sling/provisioning/model/io
AU        src/test/java/org/apache/sling/provisioning/model/io/IOTest.java
AU        src/test/java/org/apache/sling/provisioning/model/FeatureTest.java
A         src/test/java/org/apache/sling/provisioning/model/CustomResolverTest.java
AU        src/test/java/org/apache/sling/provisioning/model/ModelProcessorTest.java
AU        src/test/java/org/apache/sling/provisioning/model/ModelResolveUtilityReplaceTest.java
AU        src/test/java/org/apache/sling/provisioning/model/ModelUtilityApplyArtifactVersionsTest.java
AU        src/test/java/org/apache/sling/provisioning/model/MergeUtilityTest.java
AU        src/test/java/org/apache/sling/provisioning/model/ModelUtilityApplyVariablesTest.java
A         src/main
A         src/main/java
A         src/main/java/org
A         src/main/java/org/apache
A         src/main/java/org/apache/sling
A         src/main/java/org/apache/sling/provisioning
A         src/main/java/org/apache/sling/provisioning/model
AU        src/main/java/org/apache/sling/provisioning/model/FeatureTypes.java
AU        src/main/java/org/apache/sling/provisioning/model/EffectiveModelProcessor.java
AU        src/main/java/org/apache/sling/provisioning/model/Traceable.java
AU        src/main/java/org/apache/sling/provisioning/model/KeyValueMap.java
AU        src/main/java/org/apache/sling/provisioning/model/MergeUtility.java
AU        src/main/java/org/apache/sling/provisioning/model/package-info.java
AU        src/main/java/org/apache/sling/provisioning/model/ModelResolveUtility.java
AU        src/main/java/org/apache/sling/provisioning/model/ModelUtility.java
AU        src/main/java/org/apache/sling/provisioning/model/Version.java
AU        src/main/java/org/apache/sling/provisioning/model/Commentable.java
A         src/main/java/org/apache/sling/provisioning/model/io
AU        src/main/java/org/apache/sling/provisioning/model/io/ModelWriter.java
AU        src/main/java/org/apache/sling/provisioning/model/io/ModelArchiveWriter.java
AU        src/main/java/org/apache/sling/provisioning/model/io/ModelReader.java
AU        src/main/java/org/apache/sling/provisioning/model/io/package-info.java
AU        src/main/java/org/apache/sling/provisioning/model/io/ModelArchiveReader.java
AU        src/main/java/org/apache/sling/provisioning/model/ItemList.java
AU        src/main/java/org/apache/sling/provisioning/model/Feature.java
AU        src/main/java/org/apache/sling/provisioning/model/ModelConstants.java
AU        src/main/java/org/apache/sling/provisioning/model/Artifact.java
AU        src/main/java/org/apache/sling/provisioning/model/ModelProcessor.java
AU        src/main/java/org/apache/sling/provisioning/model/Model.java
AU        src/main/java/org/apache/sling/provisioning/model/Section.java
AU        src/main/java/org/apache/sling/provisioning/model/Configuration.java
AU        src/main/java/org/apache/sling/provisioning/model/RunMode.java
AU        src/main/java/org/apache/sling/provisioning/model/ArtifactGroup.java
AU        pom.xml
 U        .
At revision 1785621

Parsing POMs
Failed to transfer Could not find artifact org.apache.sling:sling:pom:30 in central (http://repo.maven.apache.org/maven2)
ERROR: Failed to parse POMs
java.io.IOException: remote file operation failed: <https://builds.apache.org/job/sling-tooling-support-provisioning-model-1.7/ws/>
at hudson.remoting.Channel@64dbb9f5:ubuntu-4: hudson.remoting.ProxyException: hudson.maven.MavenModuleSetBuild$MavenExecutionException:
org.apache.maven.project.ProjectBuildingException: Some problems were encountered while processing
the POMs:
[FATAL] Non-resolvable parent POM: Could not find artifact org.apache.sling:sling:pom:30 in
central (http://repo.maven.apache.org/maven2) and 'parent.relativePath' points at no local
POM @ line 17, column 13

	at hudson.FilePath.act(FilePath.java:992)
	at hudson.FilePath.act(FilePath.java:974)
	at hudson.maven.MavenModuleSetBuild$MavenModuleSetBuildExecution.parsePoms(MavenModuleSetBuild.java:980)
	at hudson.maven.MavenModuleSetBuild$MavenModuleSetBuildExecution.doRun(MavenModuleSetBuild.java:692)
	at hudson.model.AbstractBuild$AbstractBuildExecution.run(AbstractBuild.java:534)
	at hudson.model.Run.execute(Run.java:1728)
	at hudson.maven.MavenModuleSetBuild.run(MavenModuleSetBuild.java:544)
	at hudson.model.ResourceController.execute(ResourceController.java:98)
	at hudson.model.Executor.run(Executor.java:404)
Caused by: hudson.remoting.ProxyException: hudson.maven.MavenModuleSetBuild$MavenExecutionException:
org.apache.maven.project.ProjectBuildingException: Some problems were encountered while processing
the POMs:
[FATAL] Non-resolvable parent POM: Could not find artifact org.apache.sling:sling:pom:30 in
central (http://repo.maven.apache.org/maven2) and 'parent.relativePath' points at no local
POM @ line 17, column 13

	at hudson.maven.MavenModuleSetBuild$PomParser.invoke(MavenModuleSetBuild.java:1384)
	at hudson.maven.MavenModuleSetBuild$PomParser.invoke(MavenModuleSetBuild.java:1118)
	at hudson.FilePath$FileCallableWrapper.call(FilePath.java:2731)
	at hudson.remoting.UserRequest.perform(UserRequest.java:153)
	at hudson.remoting.UserRequest.perform(UserRequest.java:50)
	at hudson.remoting.Request$2.run(Request.java:336)
	at hudson.remoting.InterceptingExecutorService$1.call(InterceptingExecutorService.java:68)
	at java.util.concurrent.FutureTask.run(FutureTask.java:262)
	at java.util.concurrent.ThreadPoolExecutor.runWorker(ThreadPoolExecutor.java:1145)
	at java.util.concurrent.ThreadPoolExecutor$Worker.run(ThreadPoolExecutor.java:615)
	at java.lang.Thread.run(Thread.java:745)
	at ......remote call to ubuntu-4(Native Method)
	at hudson.remoting.Channel.attachCallSiteStackTrace(Channel.java:1537)
	at hudson.remoting.UserResponse.retrieve(UserRequest.java:253)
	at hudson.remoting.Channel.call(Channel.java:822)
	at hudson.FilePath.act(FilePath.java:985)
	... 8 more
Caused by: hudson.remoting.ProxyException: org.apache.maven.project.ProjectBuildingException:
Some problems were encountered while processing the POMs:
[FATAL] Non-resolvable parent POM: Could not find artifact org.apache.sling:sling:pom:30 in
central (http://repo.maven.apache.org/maven2) and 'parent.relativePath' points at no local
POM @ line 17, column 13

	at org.apache.maven.project.DefaultProjectBuilder.build(DefaultProjectBuilder.java:364)
	at hudson.maven.MavenEmbedder.buildProjects(MavenEmbedder.java:361)
	at hudson.maven.MavenEmbedder.readProjects(MavenEmbedder.java:331)
	at hudson.maven.MavenModuleSetBuild$PomParser.invoke(MavenModuleSetBuild.java:1321)
	at hudson.maven.MavenModuleSetBuild$PomParser.invoke(MavenModuleSetBuild.java:1118)
	at hudson.FilePath$FileCallableWrapper.call(FilePath.java:2731)
	at hudson.remoting.UserRequest.perform(UserRequest.java:153)
	at hudson.remoting.UserRequest.perform(UserRequest.java:50)
	at hudson.remoting.Request$2.run(Request.java:336)
	at hudson.remoting.InterceptingExecutorService$1.call(InterceptingExecutorService.java:68)
	at java.util.concurrent.FutureTask.run(FutureTask.java:262)
	at java.util.concurrent.ThreadPoolExecutor.runWorker(ThreadPoolExecutor.java:1145)
	at java.util.concurrent.ThreadPoolExecutor$Worker.run(ThreadPoolExecutor.java:615)
	at java.lang.Thread.run(Thread.java:745)
Recording test results

Mime
View raw message