sling-commits mailing list archives

Site index · List index
Message view « Date » · « Thread »
Top « Date » · « Thread »
From Apache Jenkins Server <jenk...@builds.apache.org>
Subject Build failed in Jenkins: sling-contrib-commons-mom-jobs-core-1.7 #7
Date Fri, 10 Mar 2017 18:28:15 GMT
See <https://builds.apache.org/job/sling-contrib-commons-mom-jobs-core-1.7/7/display/redirect>

------------------------------------------
Started by user olli
[EnvInject] - Loading node environment variables.
Building remotely on H17 (ubuntu) in workspace <https://builds.apache.org/job/sling-contrib-commons-mom-jobs-core-1.7/ws/>
Updating https://svn.apache.org/repos/asf/sling/trunk/contrib/commons/mom/jobs/core at revision
'2017-03-10T18:27:19.758 +0000'
U         pom.xml
At revision 1786408

No changes for https://svn.apache.org/repos/asf/sling/trunk/contrib/commons/mom/jobs/core
since the previous build
Parsing POMs
Modules changed, recalculating dependency graph
Established TCP socket on 33808
maven33-agent.jar already up to date
maven33-interceptor.jar already up to date
maven3-interceptor-commons.jar already up to date
[sling-contrib-commons-mom-jobs-core-1.7] $ /home/jenkins/tools/java/latest1.7/bin/java -Xmx2g
-Xms256m -cp /home/jenkins/jenkins-slave/maven33-agent.jar:/home/jenkins/tools/maven/apache-maven-3.3.9/boot/plexus-classworlds-2.5.2.jar:/home/jenkins/tools/maven/apache-maven-3.3.9/conf/logging
jenkins.maven3.agent.Maven33Main /home/jenkins/tools/maven/apache-maven-3.3.9 /home/jenkins/jenkins-slave/slave.jar
/home/jenkins/jenkins-slave/maven33-interceptor.jar /home/jenkins/jenkins-slave/maven3-interceptor-commons.jar
33808
<===[JENKINS REMOTING CAPACITY]===>   channel started
Executing Maven:  -B -f <https://builds.apache.org/job/sling-contrib-commons-mom-jobs-core-1.7/ws/pom.xml>
-Dmaven.repo.local=/home/jenkins/jenkins-slave/maven-repositories/0 -U clean deploy
[INFO] Scanning for projects...
[INFO]                                                                         
[INFO] ------------------------------------------------------------------------
[INFO] Building Apache Sling Jobs Support 1.0.1-SNAPSHOT
[INFO] ------------------------------------------------------------------------
[INFO] Downloading: http://repository.apache.org/snapshots/org/apache/sling/org.apache.sling.mom/1.0.1-SNAPSHOT/maven-metadata.xml
[INFO] Downloaded: http://repository.apache.org/snapshots/org/apache/sling/org.apache.sling.mom/1.0.1-SNAPSHOT/maven-metadata.xml
(1000 B at 2.1 KB/sec)
[INFO] 
[INFO] --- maven-clean-plugin:3.0.0:clean (default-clean) @ org.apache.sling.jobs ---
[INFO] Deleting <https://builds.apache.org/job/sling-contrib-commons-mom-jobs-core-1.7/ws/target>
[INFO] 
[INFO] --- maven-enforcer-plugin:1.4.1:enforce (enforce-java) @ org.apache.sling.jobs ---
[INFO] 
[INFO] --- maven-antrun-plugin:1.8:run (set-bundle-required-execution-environment) @ org.apache.sling.jobs
---
[INFO] Executing tasks

main:
Setting Bundle-RequiredExecutionEnvironment=JavaSE-1.7 from sling.java.version=7
[INFO] Executed tasks
[INFO] 
[INFO] --- maven-remote-resources-plugin:1.5:process (process-resource-bundles) @ org.apache.sling.jobs
---
[INFO] 
[INFO] --- maven-remote-resources-plugin:1.5:process (default) @ org.apache.sling.jobs ---
[INFO] 
[INFO] --- maven-resources-plugin:2.7:resources (default-resources) @ org.apache.sling.jobs
---
[INFO] Using 'UTF-8' encoding to copy filtered resources.
[INFO] skip non existing resourceDirectory <https://builds.apache.org/job/sling-contrib-commons-mom-jobs-core-1.7/ws/src/main/resources>
[INFO] Copying 3 resources
[INFO] Copying 3 resources
[INFO] 
[INFO] --- maven-compiler-plugin:3.5.1:compile (default-compile) @ org.apache.sling.jobs ---
[INFO] Changes detected - recompiling the module!
[INFO] Compiling 26 source files to <https://builds.apache.org/job/sling-contrib-commons-mom-jobs-core-1.7/ws/target/classes>
[INFO] <https://builds.apache.org/job/sling-contrib-commons-mom-jobs-core-1.7/ws/src/main/java/org/apache/sling/jobs/impl/Utils.java>:
<https://builds.apache.org/job/sling-contrib-commons-mom-jobs-core-1.7/ws/src/main/java/org/apache/sling/jobs/impl/Utils.java>
uses unchecked or unsafe operations.
[INFO] <https://builds.apache.org/job/sling-contrib-commons-mom-jobs-core-1.7/ws/src/main/java/org/apache/sling/jobs/impl/Utils.java>:
Recompile with -Xlint:unchecked for details.
[INFO] 
[INFO] --- maven-scr-plugin:1.23.0:scr (generate-scr-scrdescriptor) @ org.apache.sling.jobs
---
[INFO] Downloading: https://repo.maven.apache.org/maven2/org/apache/felix/org.apache.felix.scr.generator/1.15.0/org.apache.felix.scr.generator-1.15.0.pom
[INFO] Downloaded: https://repo.maven.apache.org/maven2/org/apache/felix/org.apache.felix.scr.generator/1.15.0/org.apache.felix.scr.generator-1.15.0.pom
(4 KB at 12.7 KB/sec)
[INFO] Downloading: https://repo.maven.apache.org/maven2/org/apache/felix/org.apache.felix.scr.generator/1.15.0/org.apache.felix.scr.generator-1.15.0.jar
[INFO] Downloaded: https://repo.maven.apache.org/maven2/org/apache/felix/org.apache.felix.scr.generator/1.15.0/org.apache.felix.scr.generator-1.15.0.jar
(105 KB at 1359.7 KB/sec)
[JENKINS] Archiving disabled
[JENKINS] Archiving disabled[INFO] ------------------------------------------------------------------------
[INFO] BUILD FAILURE
[INFO] ------------------------------------------------------------------------
[INFO] Total time: 8.686 s
[INFO] Finished at: 2017-03-10T18:28:15+00:00

[INFO] Final Memory: 34M/451M
[INFO] ------------------------------------------------------------------------
Waiting for Jenkins to finish collecting data
[ERROR] Failed to execute goal org.apache.felix:maven-scr-plugin:1.23.0:scr (generate-scr-scrdescriptor)
on project org.apache.sling.jobs: No annotation processors found in classpath. -> [Help
1]
[ERROR] 
[ERROR] To see the full stack trace of the errors, re-run Maven with the -e switch.
[ERROR] Re-run Maven using the -X switch to enable full debug logging.
[ERROR] 
[ERROR] For more information about the errors and possible solutions, please read the following
articles:
[ERROR] [Help 1] http://cwiki.apache.org/confluence/display/MAVEN/MojoFailureException
channel stopped
Recording test results

Mime
View raw message