sling-commits mailing list archives

Site index · List index
Message view « Date » · « Thread »
Top « Date » · « Thread »
From Apache Jenkins Server <jenk...@builds.apache.org>
Subject Build failed in Jenkins: sling-bundles-extensions-caconfig-integration-tests-1.8 #8393
Date Mon, 20 Mar 2017 22:52:35 GMT
See <https://builds.apache.org/job/sling-bundles-extensions-caconfig-integration-tests-1.8/8393/display/redirect?page=changes>

Changes:

[sseifert] update to next snapshot version until releases available at maven central

------------------------------------------
Started by upstream project "sling-launchpad-builder-1.8" build number 8980
originally caused by:
 Started by upstream project "sling-bundles-extensions-caconfig-integration-tests-1.8" build
number 8392
 originally caused by:
  Started by upstream project "sling-launchpad-builder-1.8" build number 8979
  originally caused by:
   Started by upstream project "sling-bundles-extensions-caconfig-spi-1.7" build number 8
   originally caused by:
    Started by an SCM change
[EnvInject] - Loading node environment variables.
Building remotely on ubuntu-1 (ubuntu) in workspace <https://builds.apache.org/job/sling-bundles-extensions-caconfig-integration-tests-1.8/ws/>
Updating https://svn.apache.org/repos/asf/sling/trunk/bundles/extensions/caconfig/integration-tests
at revision '2017-03-20T22:51:41.456 +0000'
U         pom.xml
At revision 1787876

Parsing POMs
Modules changed, recalculating dependency graph
Established TCP socket on 33441
maven33-agent.jar already up to date
maven33-interceptor.jar already up to date
maven3-interceptor-commons.jar already up to date
[sling-bundles-extensions-caconfig-integration-tests-1.8] $ /home/jenkins/tools/java/latest1.8/bin/java
-Xmx2g -Xms256m -cp /home/jenkins/jenkins-slave/maven33-agent.jar:/home/jenkins/tools/maven/apache-maven-3.3.9/boot/plexus-classworlds-2.5.2.jar:/home/jenkins/tools/maven/apache-maven-3.3.9/conf/logging
jenkins.maven3.agent.Maven33Main /home/jenkins/tools/maven/apache-maven-3.3.9 /home/jenkins/jenkins-slave/slave.jar
/home/jenkins/jenkins-slave/maven33-interceptor.jar /home/jenkins/jenkins-slave/maven3-interceptor-commons.jar
33441
<===[JENKINS REMOTING CAPACITY]===>   channel started
Executing Maven:  -B -f <https://builds.apache.org/job/sling-bundles-extensions-caconfig-integration-tests-1.8/ws/pom.xml>
-Dmaven.repo.local=/home/jenkins/jenkins-slave/maven-repositories/0 -U clean deploy
[INFO] Scanning for projects...
[INFO] Downloading: http://repository.apache.org/snapshots/org/apache/sling/org.apache.sling.launchpad/9-SNAPSHOT/maven-metadata.xml
[INFO] Downloaded: http://repository.apache.org/snapshots/org/apache/sling/org.apache.sling.launchpad/9-SNAPSHOT/maven-metadata.xml
(2 KB at 3.1 KB/sec)
[INFO] Downloading: http://repository.apache.org/snapshots/org/apache/sling/org.apache.sling.launchpad/9-SNAPSHOT/org.apache.sling.launchpad-9-20170320.225001-10502-slingfeature.txt
[INFO] Downloaded: http://repository.apache.org/snapshots/org/apache/sling/org.apache.sling.launchpad/9-SNAPSHOT/org.apache.sling.launchpad-9-20170320.225001-10502-slingfeature.txt
(29 KB at 77.3 KB/sec)
[INFO] Extended Maven classpath (scope 'provided') by the dependencies extracted from the
Sling model.
[INFO]                                                                         
[INFO] ------------------------------------------------------------------------
[INFO] Building Apache Sling Context-Aware Configuration Integration Tests 1-SNAPSHOT
[INFO] ------------------------------------------------------------------------
[INFO] Downloading: http://repository.apache.org/snapshots/org/apache/sling/org.apache.sling.caconfig.api/1.1.1-SNAPSHOT/maven-metadata.xml
[INFO] Downloaded: http://repository.apache.org/snapshots/org/apache/sling/org.apache.sling.caconfig.api/1.1.1-SNAPSHOT/maven-metadata.xml
(1009 B at 2.7 KB/sec)
[INFO] Downloading: http://repository.apache.org/snapshots/org/apache/sling/org.apache.sling.caconfig.spi/1.3.1-SNAPSHOT/maven-metadata.xml
[INFO] Downloaded: http://repository.apache.org/snapshots/org/apache/sling/org.apache.sling.caconfig.spi/1.3.1-SNAPSHOT/maven-metadata.xml
(1009 B at 2.7 KB/sec)
[INFO] Downloading: http://repository.apache.org/snapshots/org/apache/sling/org.apache.sling.caconfig.spi/1.3.1-SNAPSHOT/org.apache.sling.caconfig.spi-1.3.1-20170320.224324-1.pom
[INFO] Downloaded: http://repository.apache.org/snapshots/org/apache/sling/org.apache.sling.caconfig.spi/1.3.1-SNAPSHOT/org.apache.sling.caconfig.spi-1.3.1-20170320.224324-1.pom
(5 KB at 12.0 KB/sec)
[INFO] Downloading: http://repository.apache.org/snapshots/org/apache/sling/org.apache.sling.caconfig.impl/1.3.1-SNAPSHOT/maven-metadata.xml
[INFO] Downloading: http://repository.apache.org/snapshots/org/apache/sling/org.apache.sling.caconfig.impl/1.3.1-SNAPSHOT/org.apache.sling.caconfig.impl-1.3.1-SNAPSHOT.pom
[WARNING] The POM for org.apache.sling:org.apache.sling.caconfig.impl:jar:1.3.1-SNAPSHOT is
missing, no dependency information available
[INFO] Downloading: http://repository.apache.org/snapshots/org/apache/sling/org.apache.sling.launchpad/9-SNAPSHOT/org.apache.sling.launchpad-9-20170320.225001-10502.pom
[INFO] Downloaded: http://repository.apache.org/snapshots/org/apache/sling/org.apache.sling.launchpad/9-SNAPSHOT/org.apache.sling.launchpad-9-20170320.225001-10502.pom
(8 KB at 19.0 KB/sec)
[INFO] Downloading: http://repository.apache.org/snapshots/org/apache/sling/org.apache.sling.commons.log/5.0.1-SNAPSHOT/maven-metadata.xml
[INFO] Downloaded: http://repository.apache.org/snapshots/org/apache/sling/org.apache.sling.commons.log/5.0.1-SNAPSHOT/maven-metadata.xml
(1008 B at 2.7 KB/sec)
[INFO] Downloading: http://repository.apache.org/snapshots/org/apache/sling/org.apache.sling.jcr.oak.server/1.1.3-SNAPSHOT/maven-metadata.xml
[INFO] Downloaded: http://repository.apache.org/snapshots/org/apache/sling/org.apache.sling.jcr.oak.server/1.1.3-SNAPSHOT/maven-metadata.xml
(1019 B at 2.8 KB/sec)
[INFO] Downloading: http://repository.apache.org/snapshots/org/apache/sling/org.apache.sling.engine/2.6.7-SNAPSHOT/maven-metadata.xml
[INFO] Downloaded: http://repository.apache.org/snapshots/org/apache/sling/org.apache.sling.engine/2.6.7-SNAPSHOT/maven-metadata.xml
(1003 B at 2.7 KB/sec)
[INFO] Downloading: http://repository.apache.org/snapshots/org/apache/sling/org.apache.sling.jcr.contentloader/2.1.11-SNAPSHOT/maven-metadata.xml
[INFO] Downloaded: http://repository.apache.org/snapshots/org/apache/sling/org.apache.sling.jcr.contentloader/2.1.11-SNAPSHOT/maven-metadata.xml
(2 KB at 2.8 KB/sec)
[INFO] Downloading: http://repository.apache.org/snapshots/org/apache/sling/org.apache.sling.launchpad.content/2.0.9-SNAPSHOT/maven-metadata.xml
[INFO] Downloaded: http://repository.apache.org/snapshots/org/apache/sling/org.apache.sling.launchpad.content/2.0.9-SNAPSHOT/maven-metadata.xml
(2 KB at 2.7 KB/sec)
[INFO] Downloading: http://repository.apache.org/snapshots/org/apache/sling/org.apache.sling.scripting.el-api/1.0.0-SNAPSHOT/maven-metadata.xml
[INFO] Downloaded: http://repository.apache.org/snapshots/org/apache/sling/org.apache.sling.scripting.el-api/1.0.0-SNAPSHOT/maven-metadata.xml
(1013 B at 2.7 KB/sec)
[INFO] Downloading: http://repository.apache.org/snapshots/org/apache/sling/org.apache.sling.scripting.jsp-api/1.0.0-SNAPSHOT/maven-metadata.xml
[INFO] Downloaded: http://repository.apache.org/snapshots/org/apache/sling/org.apache.sling.scripting.jsp-api/1.0.0-SNAPSHOT/maven-metadata.xml
(1014 B at 2.7 KB/sec)
[INFO] Downloading: http://repository.apache.org/snapshots/org/apache/sling/org.apache.sling.scripting.jsp/2.2.7-SNAPSHOT/maven-metadata.xml
[INFO] Downloaded: http://repository.apache.org/snapshots/org/apache/sling/org.apache.sling.scripting.jsp/2.2.7-SNAPSHOT/maven-metadata.xml
(1014 B at 2.7 KB/sec)
[INFO] Downloading: http://repository.apache.org/snapshots/org/apache/sling/org.apache.sling.validation.api/1.0.0-SNAPSHOT/maven-metadata.xml
[INFO] Downloaded: http://repository.apache.org/snapshots/org/apache/sling/org.apache.sling.validation.api/1.0.0-SNAPSHOT/maven-metadata.xml
(1023 B at 2.7 KB/sec)
[INFO] Downloading: http://repository.apache.org/snapshots/org/apache/sling/org.apache.sling.validation.core/1.0.0-SNAPSHOT/maven-metadata.xml
[INFO] Downloaded: http://repository.apache.org/snapshots/org/apache/sling/org.apache.sling.validation.core/1.0.0-SNAPSHOT/maven-metadata.xml
(1 KB at 2.8 KB/sec)
[INFO] Downloading: http://repository.apache.org/snapshots/org/apache/sling/org.apache.sling.caconfig.spi/1.3.1-SNAPSHOT/org.apache.sling.caconfig.spi-1.3.1-20170320.224324-1.jar
[INFO] Downloading: http://repository.apache.org/snapshots/org/apache/sling/org.apache.sling.caconfig.impl/1.3.1-SNAPSHOT/org.apache.sling.caconfig.impl-1.3.1-SNAPSHOT.jar
[INFO] Downloaded: http://repository.apache.org/snapshots/org/apache/sling/org.apache.sling.caconfig.spi/1.3.1-SNAPSHOT/org.apache.sling.caconfig.spi-1.3.1-20170320.224324-1.jar
(27 KB at 58.1 KB/sec)
[JENKINS] Archiving disabled
[JENKINS] Archiving disabled[INFO] ------------------------------------------------------------------------
[INFO] BUILD FAILURE
[INFO] ------------------------------------------------------------------------
[INFO] Total time: 10.465 s
[INFO] Finished at: 2017-03-20T22:52:35+00:00

[INFO] Final Memory: 25M/343M
[INFO] ------------------------------------------------------------------------
Waiting for Jenkins to finish collecting data
[ERROR] Failed to execute goal on project org.apache.sling.caconfig.integration-tests: Could
not resolve dependencies for project org.apache.sling:org.apache.sling.caconfig.integration-tests:slingstart:1-SNAPSHOT:
Could not find artifact org.apache.sling:org.apache.sling.caconfig.impl:jar:1.3.1-SNAPSHOT
in Nexus (http://repository.apache.org/snapshots) -> [Help 1]
[ERROR] 
[ERROR] To see the full stack trace of the errors, re-run Maven with the -e switch.
[ERROR] Re-run Maven using the -X switch to enable full debug logging.
[ERROR] 
[ERROR] For more information about the errors and possible solutions, please read the following
articles:
[ERROR] [Help 1] http://cwiki.apache.org/confluence/display/MAVEN/DependencyResolutionException
channel stopped
Recording test results
ERROR: Step ?Publish JUnit test result report? failed: Test reports were found but none of
them are new. Did tests run? 
For example, <https://builds.apache.org/job/sling-bundles-extensions-caconfig-integration-tests-1.8/ws/target/failsafe-reports/TEST-org.apache.sling.caconfig.it.AdaptToConfigClassIT.xml>
is 4 min 28 sec old



Mime
View raw message