sling-commits mailing list archives

Site index · List index
Message view « Date » · « Thread »
Top « Date » · « Thread »
From Apache Jenkins Server <jenk...@builds.apache.org>
Subject Build failed in Jenkins: sling-contrib-commons-mom-jms-1.7 #5
Date Fri, 10 Mar 2017 18:28:37 GMT
See <https://builds.apache.org/job/sling-contrib-commons-mom-jms-1.7/5/display/redirect>

------------------------------------------
Started by user olli
[EnvInject] - Loading node environment variables.
Building remotely on ubuntu-eu3 (ubuntu) in workspace <https://builds.apache.org/job/sling-contrib-commons-mom-jms-1.7/ws/>
Checking out a fresh workspace because there's no workspace at <https://builds.apache.org/job/sling-contrib-commons-mom-jms-1.7/ws/>
Cleaning local Directory .
Checking out https://svn.apache.org/repos/asf/sling/trunk/contrib/commons/mom/jms at revision
'2017-03-10T18:27:14.134 +0000'
A         .gitignore
A         src
A         src/test
A         src/test/java
A         src/test/java/org
A         src/test/java/org/apache
A         src/test/java/org/apache/sling
A         src/test/java/org/apache/sling/jms
AU        src/test/java/org/apache/sling/jms/JMSTopicManagerTest.java
AU        src/test/java/org/apache/sling/jms/JMSQueueManagerTest.java
AU        src/test/java/org/apache/sling/jms/JsonTest.java
A         src/test/java/org/apache/sling/amq
AU        src/test/java/org/apache/sling/amq/ActiveMQConnectionFactoryServiceTest.java
A         src/main
A         src/main/java
A         src/main/java/org
A         src/main/java/org/apache
A         src/main/java/org/apache/sling
A         src/main/java/org/apache/sling/jms
A         src/main/java/org/apache/sling/jms/impl
AU        src/main/java/org/apache/sling/jms/impl/JMSMessageTypes.java
AU        src/main/java/org/apache/sling/jms/impl/JMSTopicManager.java
AU        src/main/java/org/apache/sling/jms/impl/JMSQueueManager.java
AU        src/main/java/org/apache/sling/jms/impl/Json.java
AU        src/main/java/org/apache/sling/jms/package-info.java
AU        src/main/java/org/apache/sling/jms/ConnectionFactoryService.java
A         src/main/java/org/apache/sling/amq
AU        src/main/java/org/apache/sling/amq/ActiveMQConnectionFactoryService.java
A         src/main/resources
A         src/main/resources/org
A         src/main/resources/org/apache
A         src/main/resources/org/apache/sling
A         src/main/resources/org/apache/sling/amq
AU        src/main/resources/org/apache/sling/amq/activemq.xml
AU        src/main/resources/org/apache/sling/amq/credentials.properties
AU        src/main/resources/org/apache/sling/amq/jetty.xml
AU        pom.xml
AU        README.md
 U        .
At revision 1786408

No changes for https://svn.apache.org/repos/asf/sling/trunk/contrib/commons/mom/jms since
the previous build
Parsing POMs
Modules changed, recalculating dependency graph
Established TCP socket on 38440
maven33-agent.jar already up to date
maven33-interceptor.jar already up to date
maven3-interceptor-commons.jar already up to date
[sling-contrib-commons-mom-jms-1.7] $ /home/jenkins/tools/java/latest1.7/bin/java -Xmx2g -Xms256m
-cp /home/jenkins/jenkins-slave/maven33-agent.jar:/home/jenkins/tools/maven/apache-maven-3.3.9/boot/plexus-classworlds-2.5.2.jar:/home/jenkins/tools/maven/apache-maven-3.3.9/conf/logging
jenkins.maven3.agent.Maven33Main /home/jenkins/tools/maven/apache-maven-3.3.9 /home/jenkins/jenkins-slave/slave.jar
/home/jenkins/jenkins-slave/maven33-interceptor.jar /home/jenkins/jenkins-slave/maven3-interceptor-commons.jar
38440
<===[JENKINS REMOTING CAPACITY]===>   channel started
Executing Maven:  -B -f <https://builds.apache.org/job/sling-contrib-commons-mom-jms-1.7/ws/pom.xml>
-Dmaven.repo.local=/home/jenkins/jenkins-slave/maven-repositories/0 -U clean deploy
[INFO] Scanning for projects...
[INFO]                                                                         
[INFO] ------------------------------------------------------------------------
[INFO] Building Apache Sling MoM Implementation using JMS with AMQ 1.0.1-SNAPSHOT
[INFO] ------------------------------------------------------------------------
[INFO] Downloading: http://repository.apache.org/snapshots/org/apache/sling/org.apache.sling.mom/1.0.1-SNAPSHOT/maven-metadata.xml
[INFO] Downloaded: http://repository.apache.org/snapshots/org/apache/sling/org.apache.sling.mom/1.0.1-SNAPSHOT/maven-metadata.xml
(1000 B at 2.1 KB/sec)
[INFO] Downloading: http://repository.apache.org/snapshots/org/apache/sling/org.apache.sling.mom/1.0.1-SNAPSHOT/org.apache.sling.mom-1.0.1-20170227.121917-2.pom
[INFO] Downloaded: http://repository.apache.org/snapshots/org/apache/sling/org.apache.sling.mom/1.0.1-SNAPSHOT/org.apache.sling.mom-1.0.1-20170227.121917-2.pom
(4 KB at 8.8 KB/sec)
[INFO] Downloading: https://repo.maven.apache.org/maven2/org/apache/activemq/activemq-broker/5.13.2/activemq-broker-5.13.2.pom
[INFO] Downloaded: https://repo.maven.apache.org/maven2/org/apache/activemq/activemq-broker/5.13.2/activemq-broker-5.13.2.pom
(9 KB at 38.2 KB/sec)
[INFO] Downloading: https://repo.maven.apache.org/maven2/org/apache/activemq/activemq-parent/5.13.2/activemq-parent-5.13.2.pom
[INFO] Downloaded: https://repo.maven.apache.org/maven2/org/apache/activemq/activemq-parent/5.13.2/activemq-parent-5.13.2.pom
(60 KB at 1095.9 KB/sec)
[INFO] Downloading: https://repo.maven.apache.org/maven2/org/apache/activemq/activemq-client/5.13.2/activemq-client-5.13.2.pom
[INFO] Downloaded: https://repo.maven.apache.org/maven2/org/apache/activemq/activemq-client/5.13.2/activemq-client-5.13.2.pom
(14 KB at 835.5 KB/sec)
[INFO] Downloading: https://repo.maven.apache.org/maven2/org/apache/activemq/activemq-openwire-legacy/5.13.2/activemq-openwire-legacy-5.13.2.pom
[INFO] Downloaded: https://repo.maven.apache.org/maven2/org/apache/activemq/activemq-openwire-legacy/5.13.2/activemq-openwire-legacy-5.13.2.pom
(2 KB at 140.8 KB/sec)
[INFO] Downloading: https://repo.maven.apache.org/maven2/org/apache/activemq/activemq-pool/5.13.2/activemq-pool-5.13.2.pom
[INFO] Downloaded: https://repo.maven.apache.org/maven2/org/apache/activemq/activemq-pool/5.13.2/activemq-pool-5.13.2.pom
(5 KB at 319.9 KB/sec)
[INFO] Downloading: https://repo.maven.apache.org/maven2/org/apache/activemq/activemq-jms-pool/5.13.2/activemq-jms-pool-5.13.2.pom
[INFO] Downloaded: https://repo.maven.apache.org/maven2/org/apache/activemq/activemq-jms-pool/5.13.2/activemq-jms-pool-5.13.2.pom
(5 KB at 416.3 KB/sec)
[INFO] Downloading: https://repo.maven.apache.org/maven2/org/apache/activemq/activemq-kahadb-store/5.13.2/activemq-kahadb-store-5.13.2.pom
[INFO] Downloaded: https://repo.maven.apache.org/maven2/org/apache/activemq/activemq-kahadb-store/5.13.2/activemq-kahadb-store-5.13.2.pom
(10 KB at 428.8 KB/sec)
[INFO] Downloading: https://repo.maven.apache.org/maven2/commons-net/commons-net/3.3/commons-net-3.3.pom
[INFO] Downloaded: https://repo.maven.apache.org/maven2/commons-net/commons-net/3.3/commons-net-3.3.pom
(0 B at 0.0 KB/sec)
[INFO] Downloading: http://repository.apache.org/snapshots/org/apache/sling/org.apache.sling.mom/1.0.1-SNAPSHOT/org.apache.sling.mom-1.0.1-20170227.121917-2.jar
[INFO] Downloaded: http://repository.apache.org/snapshots/org/apache/sling/org.apache.sling.mom/1.0.1-SNAPSHOT/org.apache.sling.mom-1.0.1-20170227.121917-2.jar
(17 KB at 32.4 KB/sec)
[INFO] Downloading: https://repo.maven.apache.org/maven2/org/apache/activemq/activemq-broker/5.13.2/activemq-broker-5.13.2.jar
[INFO] Downloading: https://repo.maven.apache.org/maven2/org/apache/activemq/activemq-openwire-legacy/5.13.2/activemq-openwire-legacy-5.13.2.jar
[INFO] Downloading: https://repo.maven.apache.org/maven2/org/apache/activemq/activemq-client/5.13.2/activemq-client-5.13.2.jar
[INFO] Downloading: https://repo.maven.apache.org/maven2/org/apache/activemq/activemq-pool/5.13.2/activemq-pool-5.13.2.jar
[INFO] Downloading: https://repo.maven.apache.org/maven2/org/apache/activemq/activemq-jms-pool/5.13.2/activemq-jms-pool-5.13.2.jar
[INFO] Downloaded: https://repo.maven.apache.org/maven2/org/apache/activemq/activemq-pool/5.13.2/activemq-pool-5.13.2.jar
(20 KB at 318.2 KB/sec)
[INFO] Downloading: https://repo.maven.apache.org/maven2/org/apache/activemq/activemq-kahadb-store/5.13.2/activemq-kahadb-store-5.13.2.jar
[INFO] Downloaded: https://repo.maven.apache.org/maven2/org/apache/activemq/activemq-jms-pool/5.13.2/activemq-jms-pool-5.13.2.jar
(52 KB at 490.2 KB/sec)
[INFO] Downloaded: https://repo.maven.apache.org/maven2/org/apache/activemq/activemq-kahadb-store/5.13.2/activemq-kahadb-store-5.13.2.jar
(624 KB at 5067.4 KB/sec)
[INFO] Downloaded: https://repo.maven.apache.org/maven2/org/apache/activemq/activemq-broker/5.13.2/activemq-broker-5.13.2.jar
(1124 KB at 7855.6 KB/sec)
[INFO] Downloaded: https://repo.maven.apache.org/maven2/org/apache/activemq/activemq-client/5.13.2/activemq-client-5.13.2.jar
(1269 KB at 8929.9 KB/sec)
[INFO] Downloaded: https://repo.maven.apache.org/maven2/org/apache/activemq/activemq-openwire-legacy/5.13.2/activemq-openwire-legacy-5.13.2.jar
(670 KB at 3869.3 KB/sec)
[INFO] 
[INFO] --- maven-clean-plugin:3.0.0:clean (default-clean) @ org.apache.sling.jms ---
[INFO] 
[INFO] --- maven-enforcer-plugin:1.4.1:enforce (enforce-java) @ org.apache.sling.jms ---
[INFO] 
[INFO] --- maven-antrun-plugin:1.8:run (set-bundle-required-execution-environment) @ org.apache.sling.jms
---
[INFO] Executing tasks

main:
Setting Bundle-RequiredExecutionEnvironment=JavaSE-1.7 from sling.java.version=7
[INFO] Executed tasks
[INFO] 
[INFO] --- maven-remote-resources-plugin:1.5:process (process-resource-bundles) @ org.apache.sling.jms
---
[INFO] 
[INFO] --- maven-remote-resources-plugin:1.5:process (default) @ org.apache.sling.jms ---
[INFO] 
[INFO] --- maven-resources-plugin:2.7:resources (default-resources) @ org.apache.sling.jms
---
[INFO] Using 'UTF-8' encoding to copy filtered resources.
[INFO] Copying 3 resources
[INFO] Copying 3 resources
[INFO] Copying 3 resources
[INFO] 
[INFO] --- maven-compiler-plugin:3.5.1:compile (default-compile) @ org.apache.sling.jms ---
[INFO] Changes detected - recompiling the module!
[INFO] Compiling 7 source files to <https://builds.apache.org/job/sling-contrib-commons-mom-jms-1.7/ws/target/classes>
[INFO] <https://builds.apache.org/job/sling-contrib-commons-mom-jms-1.7/ws/src/main/java/org/apache/sling/jms/impl/Json.java>:
<https://builds.apache.org/job/sling-contrib-commons-mom-jms-1.7/ws/src/main/java/org/apache/sling/jms/impl/Json.java>
uses unchecked or unsafe operations.
[INFO] <https://builds.apache.org/job/sling-contrib-commons-mom-jms-1.7/ws/src/main/java/org/apache/sling/jms/impl/Json.java>:
Recompile with -Xlint:unchecked for details.
[INFO] 
[INFO] --- maven-scr-plugin:1.23.0:scr (generate-scr-scrdescriptor) @ org.apache.sling.jms
---
[JENKINS] Archiving disabled
[JENKINS] Archiving disabled
[INFO] ------------------------------------------------------------------------
[INFO] BUILD FAILURE
[INFO] ------------------------------------------------------------------------
[INFO] Total time: 15.648 s
[INFO] Finished at: 2017-03-10T18:28:36+00:00
[INFO] Final Memory: 35M/452M
[INFO] ------------------------------------------------------------------------
Waiting for Jenkins to finish collecting data
[ERROR] Failed to execute goal org.apache.felix:maven-scr-plugin:1.23.0:scr (generate-scr-scrdescriptor)
on project org.apache.sling.jms: No annotation processors found in classpath. -> [Help
1]
[ERROR] 
[ERROR] To see the full stack trace of the errors, re-run Maven with the -e switch.
[ERROR] Re-run Maven using the -X switch to enable full debug logging.
[ERROR] 
[ERROR] For more information about the errors and possible solutions, please read the following
articles:
[ERROR] [Help 1] http://cwiki.apache.org/confluence/display/MAVEN/MojoFailureException
channel stopped
Recording test results

Mime
View raw message