sling-commits mailing list archives

Site index · List index
Message view « Date » · « Thread »
Top « Date » · « Thread »
From Apache Jenkins Server <jenk...@builds.apache.org>
Subject Build failed in Jenkins: sling-contrib-extensions-hapi-client-1.8 #2
Date Mon, 06 Mar 2017 10:37:27 GMT
See <https://builds.apache.org/job/sling-contrib-extensions-hapi-client-1.8/2/display/redirect?page=changes>

Changes:

[olli] use Sling Parent 30

------------------------------------------
Started by an SCM change
[EnvInject] - Loading node environment variables.
Building remotely on H18 (ubuntu) in workspace <https://builds.apache.org/job/sling-contrib-extensions-hapi-client-1.8/ws/>
Checking out a fresh workspace because there's no workspace at <https://builds.apache.org/job/sling-contrib-extensions-hapi-client-1.8/ws/>
Cleaning local Directory .
Checking out https://svn.apache.org/repos/asf/sling/trunk/contrib/extensions/hapi/client at
revision '2017-03-06T10:37:17.244 +0000'
A         .gitignore
A         src
A         src/test
A         src/test/java
A         src/test/java/org
A         src/test/java/org/apache
A         src/test/java/org/apache/sling
A         src/test/java/org/apache/sling/hapi
A         src/test/java/org/apache/sling/hapi/client
A         src/test/java/org/apache/sling/hapi/client/test
A         src/test/java/org/apache/sling/hapi/client/test/GetPostTest.java
A         src/test/java/org/apache/sling/hapi/client/test/util
A         src/test/java/org/apache/sling/hapi/client/test/util/HttpServerRule.java
A         src/test/java/org/apache/sling/hapi/client/test/ItemsTest.java
A         src/test/java/org/apache/sling/hapi/client/test/FormTest.java
A         src/test/resources
A         src/test/resources/items.html
A         src/test/resources/items_links.html
A         src/test/resources/items_forms.html
A         src/main
A         src/main/java
A         src/main/java/org
A         src/main/java/org/apache
A         src/main/java/org/apache/sling
A         src/main/java/org/apache/sling/hapi
A         src/main/java/org/apache/sling/hapi/client
A         src/main/java/org/apache/sling/hapi/client/ClientException.java
A         src/main/java/org/apache/sling/hapi/client/Document.java
A         src/main/java/org/apache/sling/hapi/client/Item.java
A         src/main/java/org/apache/sling/hapi/client/Items.java
A         src/main/java/org/apache/sling/hapi/client/impl
A         src/main/java/org/apache/sling/hapi/client/impl/microdata
A         src/main/java/org/apache/sling/hapi/client/impl/microdata/MicrodataDocument.java
A         src/main/java/org/apache/sling/hapi/client/impl/microdata/MicrodataHtmlClient.java
A         src/main/java/org/apache/sling/hapi/client/impl/HtmlClientServiceImpl.java
A         src/main/java/org/apache/sling/hapi/client/impl/AbstractHtmlClientImpl.java
A         src/main/java/org/apache/sling/hapi/client/HtmlClient.java
A         src/main/java/org/apache/sling/hapi/client/HtmlClientService.java
A         src/main/java/org/apache/sling/hapi/client/package-info.java
A         src/main/java/org/apache/sling/hapi/client/forms
A         src/main/java/org/apache/sling/hapi/client/forms/internal
A         src/main/java/org/apache/sling/hapi/client/forms/internal/FormValues.java
A         src/main/java/org/apache/sling/hapi/client/forms/internal/Vals.java
A         pom.xml
 U        .
At revision 1785622

Parsing POMs
Failed to transfer Could not find artifact org.apache.sling:sling:pom:30 in central (http://repo.maven.apache.org/maven2)
ERROR: Failed to parse POMs
java.io.IOException: remote file operation failed: <https://builds.apache.org/job/sling-contrib-extensions-hapi-client-1.8/ws/>
at hudson.remoting.Channel@4de74595:H18: hudson.remoting.ProxyException: hudson.maven.MavenModuleSetBuild$MavenExecutionException:
org.apache.maven.project.ProjectBuildingException: Some problems were encountered while processing
the POMs:
[FATAL] Non-resolvable parent POM: Could not find artifact org.apache.sling:sling:pom:30 in
central (http://repo.maven.apache.org/maven2) and 'parent.relativePath' points at no local
POM @ line 23, column 13

	at hudson.FilePath.act(FilePath.java:992)
	at hudson.FilePath.act(FilePath.java:974)
	at hudson.maven.MavenModuleSetBuild$MavenModuleSetBuildExecution.parsePoms(MavenModuleSetBuild.java:980)
	at hudson.maven.MavenModuleSetBuild$MavenModuleSetBuildExecution.doRun(MavenModuleSetBuild.java:692)
	at hudson.model.AbstractBuild$AbstractBuildExecution.run(AbstractBuild.java:534)
	at hudson.model.Run.execute(Run.java:1728)
	at hudson.maven.MavenModuleSetBuild.run(MavenModuleSetBuild.java:544)
	at hudson.model.ResourceController.execute(ResourceController.java:98)
	at hudson.model.Executor.run(Executor.java:404)
Caused by: hudson.remoting.ProxyException: hudson.maven.MavenModuleSetBuild$MavenExecutionException:
org.apache.maven.project.ProjectBuildingException: Some problems were encountered while processing
the POMs:
[FATAL] Non-resolvable parent POM: Could not find artifact org.apache.sling:sling:pom:30 in
central (http://repo.maven.apache.org/maven2) and 'parent.relativePath' points at no local
POM @ line 23, column 13

	at hudson.maven.MavenModuleSetBuild$PomParser.invoke(MavenModuleSetBuild.java:1384)
	at hudson.maven.MavenModuleSetBuild$PomParser.invoke(MavenModuleSetBuild.java:1118)
	at hudson.FilePath$FileCallableWrapper.call(FilePath.java:2731)
	at hudson.remoting.UserRequest.perform(UserRequest.java:153)
	at hudson.remoting.UserRequest.perform(UserRequest.java:50)
	at hudson.remoting.Request$2.run(Request.java:336)
	at hudson.remoting.InterceptingExecutorService$1.call(InterceptingExecutorService.java:68)
	at java.util.concurrent.FutureTask.run(FutureTask.java:262)
	at java.util.concurrent.ThreadPoolExecutor.runWorker(ThreadPoolExecutor.java:1145)
	at java.util.concurrent.ThreadPoolExecutor$Worker.run(ThreadPoolExecutor.java:615)
	at java.lang.Thread.run(Thread.java:745)
	at ......remote call to H18(Native Method)
	at hudson.remoting.Channel.attachCallSiteStackTrace(Channel.java:1537)
	at hudson.remoting.UserResponse.retrieve(UserRequest.java:253)
	at hudson.remoting.Channel.call(Channel.java:822)
	at hudson.FilePath.act(FilePath.java:985)
	... 8 more
Caused by: hudson.remoting.ProxyException: org.apache.maven.project.ProjectBuildingException:
Some problems were encountered while processing the POMs:
[FATAL] Non-resolvable parent POM: Could not find artifact org.apache.sling:sling:pom:30 in
central (http://repo.maven.apache.org/maven2) and 'parent.relativePath' points at no local
POM @ line 23, column 13

	at org.apache.maven.project.DefaultProjectBuilder.build(DefaultProjectBuilder.java:364)
	at hudson.maven.MavenEmbedder.buildProjects(MavenEmbedder.java:361)
	at hudson.maven.MavenEmbedder.readProjects(MavenEmbedder.java:331)
	at hudson.maven.MavenModuleSetBuild$PomParser.invoke(MavenModuleSetBuild.java:1321)
	at hudson.maven.MavenModuleSetBuild$PomParser.invoke(MavenModuleSetBuild.java:1118)
	at hudson.FilePath$FileCallableWrapper.call(FilePath.java:2731)
	at hudson.remoting.UserRequest.perform(UserRequest.java:153)
	at hudson.remoting.UserRequest.perform(UserRequest.java:50)
	at hudson.remoting.Request$2.run(Request.java:336)
	at hudson.remoting.InterceptingExecutorService$1.call(InterceptingExecutorService.java:68)
	at java.util.concurrent.FutureTask.run(FutureTask.java:262)
	at java.util.concurrent.ThreadPoolExecutor.runWorker(ThreadPoolExecutor.java:1145)
	at java.util.concurrent.ThreadPoolExecutor$Worker.run(ThreadPoolExecutor.java:615)
	at java.lang.Thread.run(Thread.java:745)
Recording test results

Mime
View raw message