sling-commits mailing list archives

Site index · List index
Message view « Date » · « Thread »
Top « Date » · « Thread »
From Apache Jenkins Server <jenk...@builds.apache.org>
Subject Build failed in Jenkins: sling-bundles-commons-classloader-1.7 #15
Date Mon, 06 Mar 2017 10:29:35 GMT
See <https://builds.apache.org/job/sling-bundles-commons-classloader-1.7/15/display/redirect?page=changes>

Changes:

[olli] use Sling Parent 30

------------------------------------------
Started by an SCM change
[EnvInject] - Loading node environment variables.
Building remotely on H17 (ubuntu) in workspace <https://builds.apache.org/job/sling-bundles-commons-classloader-1.7/ws/>
Checking out a fresh workspace because there's no workspace at <https://builds.apache.org/job/sling-bundles-commons-classloader-1.7/ws/>
Cleaning local Directory .
Checking out https://svn.apache.org/repos/asf/sling/trunk/bundles/commons/classloader at revision
'2017-03-06T10:29:20.362 +0000'
A         src
A         src/test
A         src/test/java
A         src/test/java/org
A         src/test/java/org/apache
A         src/test/java/org/apache/sling
A         src/test/java/org/apache/sling/commons
A         src/test/java/org/apache/sling/commons/classloader
A         src/test/java/org/apache/sling/commons/classloader/impl
AU        src/test/java/org/apache/sling/commons/classloader/impl/ClassLoadingTest.java
A         src/test/java/org/apache/sling/commons/classloader/it
AU        src/test/java/org/apache/sling/commons/classloader/it/DynamicClassLoaderIT.java
A         src/main
A         src/main/java
A         src/main/java/org
A         src/main/java/org/apache
A         src/main/java/org/apache/sling
A         src/main/java/org/apache/sling/commons
A         src/main/java/org/apache/sling/commons/classloader
AU        src/main/java/org/apache/sling/commons/classloader/package-info.java
AU        src/main/java/org/apache/sling/commons/classloader/ClassLoaderWriter.java
AU        src/main/java/org/apache/sling/commons/classloader/DynamicClassLoaderManager.java
AU        src/main/java/org/apache/sling/commons/classloader/DynamicClassLoaderProvider.java
A         src/main/java/org/apache/sling/commons/classloader/ClassLoaderWriterListener.java
AU        src/main/java/org/apache/sling/commons/classloader/DynamicClassLoader.java
A         src/main/java/org/apache/sling/commons/classloader/impl
AU        src/main/java/org/apache/sling/commons/classloader/impl/BundleProxyClassLoader.java
AU        src/main/java/org/apache/sling/commons/classloader/impl/Activator.java
AU        src/main/java/org/apache/sling/commons/classloader/impl/DynamicClassLoaderManagerImpl.java
AU        src/main/java/org/apache/sling/commons/classloader/impl/ClassLoaderFacade.java
AU        src/main/java/org/apache/sling/commons/classloader/impl/PackageAdminClassLoader.java
AU        src/main/java/org/apache/sling/commons/classloader/impl/DynamicClassLoaderManagerFactory.java
AU        pom.xml
 U        .
At revision 1785621

Parsing POMs
Failed to transfer Could not find artifact org.apache.sling:sling:pom:30 in central (http://repo.maven.apache.org/maven2)
ERROR: Failed to parse POMs
java.io.IOException: remote file operation failed: <https://builds.apache.org/job/sling-bundles-commons-classloader-1.7/ws/>
at hudson.remoting.Channel@690d38df:H17: hudson.remoting.ProxyException: hudson.maven.MavenModuleSetBuild$MavenExecutionException:
org.apache.maven.project.ProjectBuildingException: Some problems were encountered while processing
the POMs:
[FATAL] Non-resolvable parent POM: Could not find artifact org.apache.sling:sling:pom:30 in
central (http://repo.maven.apache.org/maven2) and 'parent.relativePath' points at no local
POM @ line 23, column 13

	at hudson.FilePath.act(FilePath.java:992)
	at hudson.FilePath.act(FilePath.java:974)
	at hudson.maven.MavenModuleSetBuild$MavenModuleSetBuildExecution.parsePoms(MavenModuleSetBuild.java:980)
	at hudson.maven.MavenModuleSetBuild$MavenModuleSetBuildExecution.doRun(MavenModuleSetBuild.java:692)
	at hudson.model.AbstractBuild$AbstractBuildExecution.run(AbstractBuild.java:534)
	at hudson.model.Run.execute(Run.java:1728)
	at hudson.maven.MavenModuleSetBuild.run(MavenModuleSetBuild.java:544)
	at hudson.model.ResourceController.execute(ResourceController.java:98)
	at hudson.model.Executor.run(Executor.java:404)
Caused by: hudson.remoting.ProxyException: hudson.maven.MavenModuleSetBuild$MavenExecutionException:
org.apache.maven.project.ProjectBuildingException: Some problems were encountered while processing
the POMs:
[FATAL] Non-resolvable parent POM: Could not find artifact org.apache.sling:sling:pom:30 in
central (http://repo.maven.apache.org/maven2) and 'parent.relativePath' points at no local
POM @ line 23, column 13

	at hudson.maven.MavenModuleSetBuild$PomParser.invoke(MavenModuleSetBuild.java:1384)
	at hudson.maven.MavenModuleSetBuild$PomParser.invoke(MavenModuleSetBuild.java:1118)
	at hudson.FilePath$FileCallableWrapper.call(FilePath.java:2731)
	at hudson.remoting.UserRequest.perform(UserRequest.java:153)
	at hudson.remoting.UserRequest.perform(UserRequest.java:50)
	at hudson.remoting.Request$2.run(Request.java:336)
	at hudson.remoting.InterceptingExecutorService$1.call(InterceptingExecutorService.java:68)
	at java.util.concurrent.FutureTask.run(FutureTask.java:262)
	at java.util.concurrent.ThreadPoolExecutor.runWorker(ThreadPoolExecutor.java:1145)
	at java.util.concurrent.ThreadPoolExecutor$Worker.run(ThreadPoolExecutor.java:615)
	at java.lang.Thread.run(Thread.java:745)
	at ......remote call to H17(Native Method)
	at hudson.remoting.Channel.attachCallSiteStackTrace(Channel.java:1537)
	at hudson.remoting.UserResponse.retrieve(UserRequest.java:253)
	at hudson.remoting.Channel.call(Channel.java:822)
	at hudson.FilePath.act(FilePath.java:985)
	... 8 more
Caused by: hudson.remoting.ProxyException: org.apache.maven.project.ProjectBuildingException:
Some problems were encountered while processing the POMs:
[FATAL] Non-resolvable parent POM: Could not find artifact org.apache.sling:sling:pom:30 in
central (http://repo.maven.apache.org/maven2) and 'parent.relativePath' points at no local
POM @ line 23, column 13

	at org.apache.maven.project.DefaultProjectBuilder.build(DefaultProjectBuilder.java:364)
	at hudson.maven.MavenEmbedder.buildProjects(MavenEmbedder.java:361)
	at hudson.maven.MavenEmbedder.readProjects(MavenEmbedder.java:331)
	at hudson.maven.MavenModuleSetBuild$PomParser.invoke(MavenModuleSetBuild.java:1321)
	at hudson.maven.MavenModuleSetBuild$PomParser.invoke(MavenModuleSetBuild.java:1118)
	at hudson.FilePath$FileCallableWrapper.call(FilePath.java:2731)
	at hudson.remoting.UserRequest.perform(UserRequest.java:153)
	at hudson.remoting.UserRequest.perform(UserRequest.java:50)
	at hudson.remoting.Request$2.run(Request.java:336)
	at hudson.remoting.InterceptingExecutorService$1.call(InterceptingExecutorService.java:68)
	at java.util.concurrent.FutureTask.run(FutureTask.java:262)
	at java.util.concurrent.ThreadPoolExecutor.runWorker(ThreadPoolExecutor.java:1145)
	at java.util.concurrent.ThreadPoolExecutor$Worker.run(ThreadPoolExecutor.java:615)
	at java.lang.Thread.run(Thread.java:745)
Recording test results

Mime
View raw message