sling-commits mailing list archives

Site index · List index
Message view « Date » · « Thread »
Top « Date » · « Thread »
From Apache Jenkins Server <>
Subject Build failed in Jenkins: sling-bundles-commons-fsclassloader-1.8 #8
Date Fri, 17 Feb 2017 20:53:39 GMT
See <>


[dklco] Updating to use Classloader 1.4.0

Started by an SCM change
[EnvInject] - Loading node environment variables.
Building remotely on H24 (ubuntu) in workspace <>
Updating at revision
'2017-02-17T20:52:48.588 +0000'
U         pom.xml
At revision 1783466

Parsing POMs
Modules changed, recalculating dependency graph
Established TCP socket on 42555
maven32-agent.jar already up to date
maven32-interceptor.jar already up to date
maven3-interceptor-commons.jar already up to date
[sling-bundles-commons-fsclassloader-1.8] $ /home/jenkins/tools/java/latest1.8/bin/java -Xmx2g
-Xms256m -cp /home/jenkins/jenkins-slave/maven32-agent.jar:/home/jenkins/tools/maven/apache-maven-3.3.9/boot/plexus-classworlds-2.5.2.jar:/home/jenkins/tools/maven/apache-maven-3.3.9/conf/logging
jenkins.maven3.agent.Maven32Main /home/jenkins/tools/maven/apache-maven-3.3.9 /home/jenkins/jenkins-slave/slave.jar
/home/jenkins/jenkins-slave/maven32-interceptor.jar /home/jenkins/jenkins-slave/maven3-interceptor-commons.jar
<===[JENKINS REMOTING CAPACITY]===>   channel started
Executing Maven:  -B -f <>
-Dmaven.repo.local=/home/jenkins/jenkins-slave/maven-repositories/0 -U clean verify
[INFO] Scanning for projects...
[INFO] ------------------------------------------------------------------------
[INFO] Building Apache Sling Commons FileSystem ClassLoader 1.0.5-SNAPSHOT
[INFO] ------------------------------------------------------------------------
[INFO] Downloading:
[WARNING] The POM for is missing,
no dependency information available
[INFO] Downloading:
[JENKINS] Archiving disabled
[JENKINS] Archiving disabled[INFO] ------------------------------------------------------------------------
[INFO] ------------------------------------------------------------------------
[INFO] Total time: 4.290 s
[INFO] Finished at: 2017-02-17T20:53:38+00:00

[INFO] Final Memory: 18M/276M
[INFO] ------------------------------------------------------------------------
Waiting for Jenkins to finish collecting data[ERROR] Failed to execute goal on project
Could not resolve dependencies for project
Could not find artifact in
central ( -> [Help 1]
[ERROR] To see the full stack trace of the errors, re-run Maven with the -e switch.
[ERROR] Re-run Maven using the -X switch to enable full debug logging.
[ERROR] For more information about the errors and possible solutions, please read the following
[ERROR] [Help 1]

channel stopped
Recording test results
ERROR: Step ?Publish JUnit test result report? failed: Test reports were found but none of
them are new. Did tests run? 
For example, <>
is 6 min 26 sec old

View raw message