sling-commits mailing list archives

Site index · List index
Message view « Date » · « Thread »
Top « Date » · « Thread »
From Apache Jenkins Server <jenk...@builds.apache.org>
Subject Build failed in Jenkins: sling-contrib-extensions-distribution-core-1.7 #35
Date Fri, 03 Feb 2017 15:11:16 GMT
See <https://builds.apache.org/job/sling-contrib-extensions-distribution-core-1.7/35/changes>

Changes:

[tmaret] SLING-6503 - Concurrency issue can prevent repository packages to be cleaned up

* Cleanup the ResourceDistributionPackage packages asynchronously

------------------------------------------
Started by an SCM change
[EnvInject] - Loading node environment variables.
Building remotely on H17 (ubuntu) in workspace <https://builds.apache.org/job/sling-contrib-extensions-distribution-core-1.7/ws/>
Updating https://svn.apache.org/repos/asf/sling/trunk/contrib/extensions/distribution/core
at revision '2017-02-03T15:10:31.326 +0000'
U         src/main/java/org/apache/sling/distribution/serialization/impl/vlt/VaultDistributionPackageBuilderFactory.java
U         src/main/java/org/apache/sling/distribution/serialization/impl/DistributionPackageBuilderFactory.java
U         src/main/java/org/apache/sling/distribution/packaging/impl/ResourceDistributionPackageBuilder.java
A         src/main/java/org/apache/sling/distribution/packaging/impl/ResourceDistributionPackageCleanup.java
U         src/main/java/org/apache/sling/distribution/packaging/impl/DistributionPackageUtils.java
U         src/main/java/org/apache/sling/distribution/packaging/impl/SharedDistributionPackage.java
U         src/main/java/org/apache/sling/distribution/packaging/impl/ResourceDistributionPackage.java
At revision 1781569

Parsing POMs
Established TCP socket on 39603
maven32-agent.jar already up to date
maven32-interceptor.jar already up to date
maven3-interceptor-commons.jar already up to date
[sling-contrib-extensions-distribution-core-1.7] $ /home/jenkins/tools/java/latest1.7/bin/java
-Xmx2g -Xms256m -XX:MaxPermSize=512m -cp /home/jenkins/jenkins-slave/maven32-agent.jar:/home/jenkins/tools/maven/apache-maven-3.3.9/boot/plexus-classworlds-2.5.2.jar:/home/jenkins/tools/maven/apache-maven-3.3.9/conf/logging
jenkins.maven3.agent.Maven32Main /home/jenkins/tools/maven/apache-maven-3.3.9 /home/jenkins/jenkins-slave/slave.jar
/home/jenkins/jenkins-slave/maven32-interceptor.jar /home/jenkins/jenkins-slave/maven3-interceptor-commons.jar
39603
<===[JENKINS REMOTING CAPACITY]===>   channel started
Executing Maven:  -B -f <https://builds.apache.org/job/sling-contrib-extensions-distribution-core-1.7/ws/pom.xml>
-Dmaven.repo.local=/home/jenkins/jenkins-slave/maven-repositories/1 -U clean deploy
[INFO] Scanning for projects...
[INFO]                                                                         
[INFO] ------------------------------------------------------------------------
[INFO] Building Apache Sling Distribution Core 0.1.19-SNAPSHOT
[INFO] ------------------------------------------------------------------------
[INFO] Downloading: https://repo.maven.apache.org/maven2/org/apache/sling/org.apache.sling.testing.resourceresolver-mock/1.1.16/org.apache.sling.testing.resourceresolver-mock-1.1.16.pom
[INFO] Downloaded: https://repo.maven.apache.org/maven2/org/apache/sling/org.apache.sling.testing.resourceresolver-mock/1.1.16/org.apache.sling.testing.resourceresolver-mock-1.1.16.pom
(6 KB at 10.5 KB/sec)
[INFO] Downloading: https://repo.maven.apache.org/maven2/org/apache/sling/org.apache.sling.testing.sling-mock/1.6.2/org.apache.sling.testing.sling-mock-1.6.2.pom
[INFO] Downloaded: https://repo.maven.apache.org/maven2/org/apache/sling/org.apache.sling.testing.sling-mock/1.6.2/org.apache.sling.testing.sling-mock-1.6.2.pom
(11 KB at 51.3 KB/sec)
[INFO] Downloading: https://repo.maven.apache.org/maven2/org/apache/sling/org.apache.sling.testing.jcr-mock/1.1.12/org.apache.sling.testing.jcr-mock-1.1.12.pom
[INFO] Downloaded: https://repo.maven.apache.org/maven2/org/apache/sling/org.apache.sling.testing.jcr-mock/1.1.12/org.apache.sling.testing.jcr-mock-1.1.12.pom
(5 KB at 20.4 KB/sec)
[INFO] Downloading: https://repo.maven.apache.org/maven2/org/apache/sling/org.apache.sling.testing.resourceresolver-mock/1.1.16/org.apache.sling.testing.resourceresolver-mock-1.1.16.jar
[INFO] Downloading: https://repo.maven.apache.org/maven2/org/apache/sling/org.apache.sling.testing.sling-mock/1.6.2/org.apache.sling.testing.sling-mock-1.6.2.jar
[INFO] Downloading: https://repo.maven.apache.org/maven2/org/apache/sling/org.apache.sling.testing.jcr-mock/1.1.12/org.apache.sling.testing.jcr-mock-1.1.12.jar
[INFO] Downloaded: https://repo.maven.apache.org/maven2/org/apache/sling/org.apache.sling.testing.resourceresolver-mock/1.1.16/org.apache.sling.testing.resourceresolver-mock-1.1.16.jar
(35 KB at 155.8 KB/sec)
[INFO] Downloaded: https://repo.maven.apache.org/maven2/org/apache/sling/org.apache.sling.testing.jcr-mock/1.1.12/org.apache.sling.testing.jcr-mock-1.1.12.jar
(48 KB at 201.1 KB/sec)
[INFO] Downloaded: https://repo.maven.apache.org/maven2/org/apache/sling/org.apache.sling.testing.sling-mock/1.6.2/org.apache.sling.testing.sling-mock-1.6.2.jar
(80 KB at 323.4 KB/sec)
[INFO] 
[INFO] --- maven-clean-plugin:2.5:clean (default-clean) @ org.apache.sling.distribution.core
---
[INFO] Deleting <https://builds.apache.org/job/sling-contrib-extensions-distribution-core-1.7/ws/target>
[INFO] 
[INFO] --- maven-enforcer-plugin:1.3.1:enforce (enforce-java) @ org.apache.sling.distribution.core
---
[INFO] 
[INFO] --- maven-antrun-plugin:1.8:run (set-bundle-required-execution-environment) @ org.apache.sling.distribution.core
---
[INFO] Executing tasks

main:
[INFO] Executed tasks
[INFO] 
[INFO] --- maven-remote-resources-plugin:1.5:process (default) @ org.apache.sling.distribution.core
---
[INFO] 
[INFO] --- maven-resources-plugin:2.7:resources (default-resources) @ org.apache.sling.distribution.core
---
[INFO] Using 'UTF-8' encoding to copy filtered resources.
[INFO] skip non existing resourceDirectory <https://builds.apache.org/job/sling-contrib-extensions-distribution-core-1.7/ws/src/main/resources>
[INFO] Copying 3 resources
[INFO] 
[INFO] --- maven-antrun-plugin:1.8:run (check-memory-task) @ org.apache.sling.distribution.core
---
[INFO] Executing tasks

main:
     [echo] **************** WARNING (SLING-443/SLING-1782) ******************************
     [echo] On most platforms, you'll get OutOfMemoryErrors when building unless you set
     [echo] on 32bit platforms: MAVEN_OPTS="-Xmx256M -XX:MaxPermSize=256M", see SLING-443
     [echo] on 64bit platforms: MAVEN_OPTS="-Xmx512M -XX:MaxPermSize=512M", see SLING-1782
     [echo] ******************************************************************************
[INFO] Executed tasks
[INFO] 
[INFO] --- maven-compiler-plugin:3.2:compile (default-compile) @ org.apache.sling.distribution.core
---
[INFO] Changes detected - recompiling the module!
[INFO] Compiling 177 source files to <https://builds.apache.org/job/sling-contrib-extensions-distribution-core-1.7/ws/target/classes>
[INFO] <https://builds.apache.org/job/sling-contrib-extensions-distribution-core-1.7/ws/src/main/java/org/apache/sling/distribution/resources/impl/common/AbstractReadableResourceProvider.java>:
Some input files use or override a deprecated API.
[INFO] <https://builds.apache.org/job/sling-contrib-extensions-distribution-core-1.7/ws/src/main/java/org/apache/sling/distribution/resources/impl/common/AbstractReadableResourceProvider.java>:
Recompile with -Xlint:deprecation for details.
[INFO] <https://builds.apache.org/job/sling-contrib-extensions-distribution-core-1.7/ws/src/main/java/org/apache/sling/distribution/resources/impl/common/SimpleReadableResource.java>:
Some input files use unchecked or unsafe operations.
[INFO] <https://builds.apache.org/job/sling-contrib-extensions-distribution-core-1.7/ws/src/main/java/org/apache/sling/distribution/resources/impl/common/SimpleReadableResource.java>:
Recompile with -Xlint:unchecked for details.
[INFO] -------------------------------------------------------------
[ERROR] COMPILATION ERROR : 
[INFO] -------------------------------------------------------------
[ERROR] <https://builds.apache.org/job/sling-contrib-extensions-distribution-core-1.7/ws/src/main/java/org/apache/sling/distribution/packaging/impl/ResourceDistributionPackageBuilder.java>:[251,26]
org.apache.sling.distribution.packaging.impl.ResourceDistributionPackageBuilder.ResourceDistributionPackageIterator
is not abstract and does not override abstract method remove() in java.util.Iterator
[INFO] 1 error
[INFO] -------------------------------------------------------------
[JENKINS] Archiving disabled
[JENKINS] Archiving disabled[INFO] ------------------------------------------------------------------------
[INFO] BUILD FAILURE
[INFO] ------------------------------------------------------------------------
[INFO] Total time: 14.049 s
[INFO] Finished at: 2017-02-03T15:11:10+00:00

[INFO] Final Memory: 30M/383M
[INFO] ------------------------------------------------------------------------
Waiting for Jenkins to finish collecting data
[ERROR] Failed to execute goal org.apache.maven.plugins:maven-compiler-plugin:3.2:compile
(default-compile) on project org.apache.sling.distribution.core: Compilation failure
[ERROR] <https://builds.apache.org/job/sling-contrib-extensions-distribution-core-1.7/ws/src/main/java/org/apache/sling/distribution/packaging/impl/ResourceDistributionPackageBuilder.java>:[251,26]
org.apache.sling.distribution.packaging.impl.ResourceDistributionPackageBuilder.ResourceDistributionPackageIterator
is not abstract and does not override abstract method remove() in java.util.Iterator
[ERROR] -> [Help 1]
[ERROR] 
[ERROR] To see the full stack trace of the errors, re-run Maven with the -e switch.
[ERROR] Re-run Maven using the -X switch to enable full debug logging.
[ERROR] 
[ERROR] For more information about the errors and possible solutions, please read the following
articles:
[ERROR] [Help 1] http://cwiki.apache.org/confluence/display/MAVEN/MojoFailureException
channel stopped
Recording test results

Mime
View raw message