sling-commits mailing list archives

Site index · List index
Message view « Date » · « Thread »
Top « Date » · « Thread »
From Apache Jenkins Server <jenk...@builds.apache.org>
Subject Build failed in Jenkins: sling-bundles-extensions-validation-core-1.8 #2
Date Thu, 02 Feb 2017 12:03:16 GMT
See <https://builds.apache.org/job/sling-bundles-extensions-validation-core-1.8/2/changes>

Changes:

[olli] use Sling parent 29

------------------------------------------
Started by an SCM change
[EnvInject] - Loading node environment variables.
Building remotely on H12 (ubuntu) in workspace <https://builds.apache.org/job/sling-bundles-extensions-validation-core-1.8/ws/>
Checking out a fresh workspace because there's no workspace at <https://builds.apache.org/job/sling-bundles-extensions-validation-core-1.8/ws/>
Cleaning local Directory .
Checking out https://svn.apache.org/repos/asf/sling/trunk/bundles/extensions/validation/core
at revision '2017-02-02T12:03:11.741 +0000'
A         src
A         src/test
A         src/test/java
A         src/test/java/org
A         src/test/java/org/apache
A         src/test/java/org/apache/sling
A         src/test/java/org/apache/sling/validation
A         src/test/java/org/apache/sling/validation/impl
A         src/test/java/org/apache/sling/validation/impl/resourcemodel
A         src/test/java/org/apache/sling/validation/impl/resourcemodel/ResourceValidationModelProviderImplTest.java
A         src/test/java/org/apache/sling/validation/impl/ValidationServiceImplTest.java
A         src/test/java/org/apache/sling/validation/impl/util
A         src/test/java/org/apache/sling/validation/impl/util/TrieTest.java
A         src/test/java/org/apache/sling/validation/impl/util/examplevalidators
A         src/test/java/org/apache/sling/validation/impl/util/examplevalidators/StringArrayValidator.java
A         src/test/java/org/apache/sling/validation/impl/util/examplevalidators/StringValidator.java
A         src/test/java/org/apache/sling/validation/impl/util/examplevalidators/ExtendedStringValidator.java
A         src/test/java/org/apache/sling/validation/impl/util/examplevalidators/DerivedStringValidator.java
A         src/test/java/org/apache/sling/validation/impl/util/examplevalidators/AbstractValidatorWithAdditionalType.java
A         src/test/java/org/apache/sling/validation/impl/util/examplevalidators/GenericTypeParameterBaseClass.java
A         src/test/java/org/apache/sling/validation/impl/util/examplevalidators/DateValidator.java
A         src/test/java/org/apache/sling/validation/impl/util/examplevalidators/IntegerValidator.java
A         src/test/java/org/apache/sling/validation/impl/util/ValidatorTypeUtilTest.java
A         src/test/java/org/apache/sling/validation/impl/model
A         src/test/java/org/apache/sling/validation/impl/model/MergedValidationModelTest.java
A         src/test/java/org/apache/sling/validation/impl/ValidationModelRetrieverImplTest.java
A         src/main
A         src/main/java
A         src/main/java/org
A         src/main/java/org/apache
A         src/main/java/org/apache/sling
A         src/main/java/org/apache/sling/validation
A         src/main/java/org/apache/sling/validation/impl
AU        src/main/java/org/apache/sling/validation/impl/CompositeValidationResult.java
A         src/main/java/org/apache/sling/validation/impl/ValidationServiceImpl.java
A         src/main/java/org/apache/sling/validation/impl/util
A         src/main/java/org/apache/sling/validation/impl/util/TrieNode.java
A         src/main/java/org/apache/sling/validation/impl/util/Trie.java
A         src/main/java/org/apache/sling/validation/impl/util/ValidatorTypeUtil.java
A         src/main/java/org/apache/sling/validation/impl/model
A         src/main/java/org/apache/sling/validation/impl/model/ChildResourceBuilder.java
A         src/main/java/org/apache/sling/validation/impl/model/ValidationModelBuilder.java
A         src/main/java/org/apache/sling/validation/impl/model/ResourcePropertyBuilder.java
A         src/main/java/org/apache/sling/validation/impl/model/ParameterizedValidatorImpl.java
A         src/main/java/org/apache/sling/validation/impl/model/ChildResourceImpl.java
A         src/main/java/org/apache/sling/validation/impl/model/ValidationModelImpl.java
A         src/main/java/org/apache/sling/validation/impl/model/ResourcePropertyImpl.java
A         src/main/java/org/apache/sling/validation/impl/model/MergedValidationModel.java
A         src/main/java/org/apache/sling/validation/impl/SlingHttpServletRequestAF.java
AU        src/main/java/org/apache/sling/validation/impl/ValidationContextImpl.java
A         src/main/java/org/apache/sling/validation/impl/ValidationModelCacheImpl.java
A         src/main/java/org/apache/sling/validation/impl/ValidationResourceVisitor.java
A         src/main/java/org/apache/sling/validation/impl/ValidationModelRetriever.java
A         src/main/java/org/apache/sling/validation/impl/ValidationModelRetrieverImpl.java
A         src/main/java/org/apache/sling/validation/impl/resourcemodel
A         src/main/java/org/apache/sling/validation/impl/resourcemodel/ResourceValidationModelProviderImpl.java
A         src/main/java/org/apache/sling/validation/impl/validators
A         src/main/java/org/apache/sling/validation/impl/validators/RegexValidator.java
A         src/main/resources
A         src/main/resources/SLING-INF
A         src/main/resources/SLING-INF/libs
A         src/main/resources/SLING-INF/libs/sling
A         src/main/resources/SLING-INF/libs/sling/validation
A         src/main/resources/SLING-INF/libs/sling/validation/i18n
A         src/main/resources/SLING-INF/libs/sling/validation/i18n/en.json
A         src/main/resources/OSGI-INF
A         src/main/resources/OSGI-INF/metatype
A         src/main/resources/OSGI-INF/metatype/metatype.properties
A         pom.xml
 U        .
At revision 1781374

Parsing POMs
ERROR: Failed to parse POMs
java.io.IOException: remote file operation failed: <https://builds.apache.org/job/sling-bundles-extensions-validation-core-1.8/ws/>
at hudson.remoting.Channel@6803df52:H12: hudson.remoting.ProxyException: hudson.maven.MavenModuleSetBuild$MavenExecutionException:
org.apache.maven.project.ProjectBuildingException: Some problems were encountered while processing
the POMs:
[ERROR] 'dependencies.dependency.version' for javax.servlet:servlet-api:jar is missing. @
line 81, column 21

	at hudson.FilePath.act(FilePath.java:1014)
	at hudson.FilePath.act(FilePath.java:996)
	at hudson.maven.MavenModuleSetBuild$MavenModuleSetBuildExecution.parsePoms(MavenModuleSetBuild.java:960)
	at hudson.maven.MavenModuleSetBuild$MavenModuleSetBuildExecution.doRun(MavenModuleSetBuild.java:679)
	at hudson.model.AbstractBuild$AbstractBuildExecution.run(AbstractBuild.java:534)
	at hudson.model.Run.execute(Run.java:1741)
	at hudson.maven.MavenModuleSetBuild.run(MavenModuleSetBuild.java:531)
	at hudson.model.ResourceController.execute(ResourceController.java:98)
	at hudson.model.Executor.run(Executor.java:410)
Caused by: hudson.remoting.ProxyException: hudson.maven.MavenModuleSetBuild$MavenExecutionException:
org.apache.maven.project.ProjectBuildingException: Some problems were encountered while processing
the POMs:
[ERROR] 'dependencies.dependency.version' for javax.servlet:servlet-api:jar is missing. @
line 81, column 21

	at hudson.maven.MavenModuleSetBuild$PomParser.invoke(MavenModuleSetBuild.java:1364)
	at hudson.maven.MavenModuleSetBuild$PomParser.invoke(MavenModuleSetBuild.java:1098)
	at hudson.FilePath$FileCallableWrapper.call(FilePath.java:2772)
	at hudson.remoting.UserRequest.perform(UserRequest.java:153)
	at hudson.remoting.UserRequest.perform(UserRequest.java:50)
	at hudson.remoting.Request$2.run(Request.java:332)
	at hudson.remoting.InterceptingExecutorService$1.call(InterceptingExecutorService.java:68)
	at java.util.concurrent.FutureTask.run(FutureTask.java:262)
	at java.util.concurrent.ThreadPoolExecutor.runWorker(ThreadPoolExecutor.java:1145)
	at java.util.concurrent.ThreadPoolExecutor$Worker.run(ThreadPoolExecutor.java:615)
	at java.lang.Thread.run(Thread.java:745)
	at ......remote call to H12(Native Method)
	at hudson.remoting.Channel.attachCallSiteStackTrace(Channel.java:1416)
	at hudson.remoting.UserResponse.retrieve(UserRequest.java:253)
	at hudson.remoting.Channel.call(Channel.java:781)
	at hudson.FilePath.act(FilePath.java:1007)
	... 8 more
Caused by: hudson.remoting.ProxyException: org.apache.maven.project.ProjectBuildingException:
Some problems were encountered while processing the POMs:
[ERROR] 'dependencies.dependency.version' for javax.servlet:servlet-api:jar is missing. @
line 81, column 21

	at org.apache.maven.project.DefaultProjectBuilder.build(DefaultProjectBuilder.java:364)
	at hudson.maven.MavenEmbedder.buildProjects(MavenEmbedder.java:361)
	at hudson.maven.MavenEmbedder.readProjects(MavenEmbedder.java:331)
	at hudson.maven.MavenModuleSetBuild$PomParser.invoke(MavenModuleSetBuild.java:1301)
	at hudson.maven.MavenModuleSetBuild$PomParser.invoke(MavenModuleSetBuild.java:1098)
	at hudson.FilePath$FileCallableWrapper.call(FilePath.java:2772)
	at hudson.remoting.UserRequest.perform(UserRequest.java:153)
	at hudson.remoting.UserRequest.perform(UserRequest.java:50)
	at hudson.remoting.Request$2.run(Request.java:332)
	at hudson.remoting.InterceptingExecutorService$1.call(InterceptingExecutorService.java:68)
	at java.util.concurrent.FutureTask.run(FutureTask.java:262)
	at java.util.concurrent.ThreadPoolExecutor.runWorker(ThreadPoolExecutor.java:1145)
	at java.util.concurrent.ThreadPoolExecutor$Worker.run(ThreadPoolExecutor.java:615)
	at java.lang.Thread.run(Thread.java:745)
Recording test results

Mime
View raw message