sling-commits mailing list archives

Site index · List index
Message view « Date » · « Thread »
Top « Date » · « Thread »
From Apache Jenkins Server <jenk...@builds.apache.org>
Subject Build failed in Jenkins: sling-installer-core-1.7 #25
Date Fri, 17 Feb 2017 12:32:12 GMT
See <https://builds.apache.org/job/sling-installer-core-1.7/25/changes>

Changes:

[pauls] [maven-release-plugin] prepare release org.apache.sling.installer.core-3.8.4

[pauls] Revert to previous version undoing SLING-6392 as there are some issues with it.

------------------------------------------
Started by an SCM change
[EnvInject] - Loading node environment variables.
Building remotely on ubuntu-eu3 (ubuntu) in workspace <https://builds.apache.org/job/sling-installer-core-1.7/ws/>
Updating https://svn.apache.org/repos/asf/sling/trunk/installer/core at revision '2017-02-17T12:30:18.017
+0000'
U         src/main/java/org/apache/sling/installer/core/impl/PersistentResourceList.java
U         pom.xml
At revision 1783384

Parsing POMs
Established TCP socket on 46135
maven32-agent.jar already up to date
maven32-interceptor.jar already up to date
maven3-interceptor-commons.jar already up to date
[sling-installer-core-1.7] $ /home/jenkins/tools/java/latest1.7/bin/java -Xmx2g -Xms256m -cp
/home/jenkins/jenkins-slave/maven32-agent.jar:/home/jenkins/tools/maven/apache-maven-3.3.9/boot/plexus-classworlds-2.5.2.jar:/home/jenkins/tools/maven/apache-maven-3.3.9/conf/logging
jenkins.maven3.agent.Maven32Main /home/jenkins/tools/maven/apache-maven-3.3.9 /home/jenkins/jenkins-slave/slave.jar
/home/jenkins/jenkins-slave/maven32-interceptor.jar /home/jenkins/jenkins-slave/maven3-interceptor-commons.jar
46135
<===[JENKINS REMOTING CAPACITY]===>   channel started
Executing Maven:  -B -f <https://builds.apache.org/job/sling-installer-core-1.7/ws/pom.xml>
-Dmaven.repo.local=/home/jenkins/jenkins-slave/maven-repositories/0 -U clean deploy
[INFO] Scanning for projects...
[INFO]                                                                         
[INFO] ------------------------------------------------------------------------
[INFO] Building Apache Sling Installer 3.8.4
[INFO] ------------------------------------------------------------------------
[INFO] 
[INFO] --- maven-clean-plugin:3.0.0:clean (default-clean) @ org.apache.sling.installer.core
---
[INFO] Deleting <https://builds.apache.org/job/sling-installer-core-1.7/ws/target>
[INFO] 
[INFO] --- maven-enforcer-plugin:1.4.1:enforce (enforce-java) @ org.apache.sling.installer.core
---
[INFO] 
[INFO] --- maven-antrun-plugin:1.8:run (set-bundle-required-execution-environment) @ org.apache.sling.installer.core
---
[INFO] Executing tasks

main:
Setting Bundle-RequiredExecutionEnvironment=JavaSE-1.7 from sling.java.version=7
[INFO] Executed tasks
[INFO] 
[INFO] --- maven-remote-resources-plugin:1.5:process (process-resource-bundles) @ org.apache.sling.installer.core
---
[INFO] 
[INFO] --- maven-remote-resources-plugin:1.5:process (default) @ org.apache.sling.installer.core
---
[INFO] 
[INFO] --- maven-resources-plugin:2.7:resources (default-resources) @ org.apache.sling.installer.core
---
[INFO] Using 'UTF-8' encoding to copy filtered resources.
[INFO] skip non existing resourceDirectory <https://builds.apache.org/job/sling-installer-core-1.7/ws/src/main/resources>
[INFO] Copying 3 resources
[INFO] Copying 3 resources
[INFO] 
[INFO] --- maven-compiler-plugin:3.5.1:compile (default-compile) @ org.apache.sling.installer.core
---
[INFO] Changes detected - recompiling the module!
[INFO] Compiling 61 source files to <https://builds.apache.org/job/sling-installer-core-1.7/ws/target/classes>
[INFO] <https://builds.apache.org/job/sling-installer-core-1.7/ws/src/main/java/org/apache/sling/installer/core/impl/util/RefreshDependenciesUtil.java>:
Some input files use or override a deprecated API.
[INFO] <https://builds.apache.org/job/sling-installer-core-1.7/ws/src/main/java/org/apache/sling/installer/core/impl/util/RefreshDependenciesUtil.java>:
Recompile with -Xlint:deprecation for details.
[INFO] <https://builds.apache.org/job/sling-installer-core-1.7/ws/src/main/java/org/apache/sling/installer/core/impl/InstallListener.java>:
Some input files use unchecked or unsafe operations.
[INFO] <https://builds.apache.org/job/sling-installer-core-1.7/ws/src/main/java/org/apache/sling/installer/core/impl/InstallListener.java>:
Recompile with -Xlint:unchecked for details.
[INFO] 
[INFO] --- maven-antrun-plugin:1.8:run (testbundle-1.0) @ org.apache.sling.installer.core
---
[WARNING] Parameter tasks is deprecated, use target instead
[INFO] Executing tasks

Create a test bundle:
      [jar] Building jar: <https://builds.apache.org/job/sling-installer-core-1.7/ws/target/org.apache.sling.installer.core-3.8.4-testbundle-1.0.jar>
[INFO] Executed tasks
[INFO] 
[INFO] --- maven-resources-plugin:2.7:testResources (default-testResources) @ org.apache.sling.installer.core
---
[INFO] Using 'UTF-8' encoding to copy filtered resources.
[INFO] skip non existing resourceDirectory <https://builds.apache.org/job/sling-installer-core-1.7/ws/src/test/resources>
[INFO] Copying 3 resources
[INFO] Copying 3 resources
[INFO] 
[INFO] --- maven-compiler-plugin:3.5.1:testCompile (default-testCompile) @ org.apache.sling.installer.core
---
[INFO] Changes detected - recompiling the module!
[INFO] Compiling 15 source files to <https://builds.apache.org/job/sling-installer-core-1.7/ws/target/test-classes>
[INFO] <https://builds.apache.org/job/sling-installer-core-1.7/ws/src/test/java/org/apache/sling/installer/core/impl/util/RefreshDependenciesUtilTest.java>:
<https://builds.apache.org/job/sling-installer-core-1.7/ws/src/test/java/org/apache/sling/installer/core/impl/util/RefreshDependenciesUtilTest.java>
uses or overrides a deprecated API.
[INFO] <https://builds.apache.org/job/sling-installer-core-1.7/ws/src/test/java/org/apache/sling/installer/core/impl/util/RefreshDependenciesUtilTest.java>:
Recompile with -Xlint:deprecation for details.
[INFO] <https://builds.apache.org/job/sling-installer-core-1.7/ws/src/test/java/org/apache/sling/installer/core/impl/MockBundleContext.java>:
<https://builds.apache.org/job/sling-installer-core-1.7/ws/src/test/java/org/apache/sling/installer/core/impl/MockBundleContext.java>
uses unchecked or unsafe operations.
[INFO] <https://builds.apache.org/job/sling-installer-core-1.7/ws/src/test/java/org/apache/sling/installer/core/impl/MockBundleContext.java>:
Recompile with -Xlint:unchecked for details.
[INFO] 
[INFO] --- maven-surefire-plugin:2.18.1:test (default-test) @ org.apache.sling.installer.core
---
[INFO] Surefire report directory: <https://builds.apache.org/job/sling-installer-core-1.7/ws/target/surefire-reports>

-------------------------------------------------------
 T E S T S
-------------------------------------------------------
Running org.apache.sling.installer.core.impl.TaskOrderingTest
Tests run: 4, Failures: 0, Errors: 0, Skipped: 0, Time elapsed: 0.041 sec - in org.apache.sling.installer.core.impl.TaskOrderingTest
Running org.apache.sling.installer.core.impl.util.RefreshDependenciesUtilTest
Tests run: 7, Failures: 0, Errors: 0, Skipped: 0, Time elapsed: 0.066 sec - in org.apache.sling.installer.core.impl.util.RefreshDependenciesUtilTest
Running org.apache.sling.installer.core.impl.InternalResourceTest
Tests run: 1, Failures: 0, Errors: 0, Skipped: 0, Time elapsed: 0 sec - in org.apache.sling.installer.core.impl.InternalResourceTest
Running org.apache.sling.installer.core.impl.RegisteredResourceComparatorTest
Tests run: 12, Failures: 0, Errors: 0, Skipped: 0, Time elapsed: 0.002 sec - in org.apache.sling.installer.core.impl.RegisteredResourceComparatorTest
Running org.apache.sling.installer.core.impl.OsgiInstallerImplTest
Tests run: 1, Failures: 0, Errors: 0, Skipped: 0, Time elapsed: 0.005 sec - in org.apache.sling.installer.core.impl.OsgiInstallerImplTest
Running org.apache.sling.installer.core.impl.RegisteredResourceTest
[main] WARN org.apache.sling.installer.core.impl.DefaultTransformer - Resource test:test:1.jar
does not have the manifest as its first entry in the archive. If this is a bundle, make sure
to put the manifest first in the jar file.
[main] WARN org.apache.sling.installer.core.impl.DefaultTransformer - Resource test:test:1.jar
does not have the manifest as its first entry in the archive. If this is a bundle, make sure
to put the manifest first in the jar file.
Tests run: 7, Failures: 0, Errors: 0, Skipped: 0, Time elapsed: 0.009 sec - in org.apache.sling.installer.core.impl.RegisteredResourceTest
Running org.apache.sling.installer.core.impl.DictionaryDigestTest
Tests run: 3, Failures: 0, Errors: 0, Skipped: 0, Time elapsed: 0 sec - in org.apache.sling.installer.core.impl.DictionaryDigestTest
Running org.apache.sling.installer.core.impl.tasks.BundleTaskCreatorTest
Tests run: 9, Failures: 0, Errors: 0, Skipped: 0, Time elapsed: 0.006 sec - in org.apache.sling.installer.core.impl.tasks.BundleTaskCreatorTest
Running org.apache.sling.installer.api.InstallableResourceTest
Tests run: 2, Failures: 0, Errors: 0, Skipped: 0, Time elapsed: 0 sec - in org.apache.sling.installer.api.InstallableResourceTest

Results :

Tests run: 46, Failures: 0, Errors: 0, Skipped: 0

[JENKINS] Recording test results
[INFO] 
[INFO] --- animal-sniffer-maven-plugin:1.15:check (default) @ org.apache.sling.installer.core
---
[INFO] Checking unresolved references to org.codehaus.mojo.signature:java17:1.0
[INFO] 
[INFO] --- maven-bundle-plugin:3.2.0:bundle (default-bundle) @ org.apache.sling.installer.core
---
[INFO] 
[INFO] >>> maven-source-plugin:3.0.1:jar (attach-sources) > generate-sources @
org.apache.sling.installer.core >>>
[INFO] 
[INFO] --- maven-enforcer-plugin:1.4.1:enforce (enforce-java) @ org.apache.sling.installer.core
---
[INFO] 
[INFO] --- maven-antrun-plugin:1.8:run (set-bundle-required-execution-environment) @ org.apache.sling.installer.core
---
[INFO] Executing tasks

main:
Setting Bundle-RequiredExecutionEnvironment=JavaSE-1.7 from sling.java.version=7
[INFO] Executed tasks
[WARNING] Failed to getClass for org.apache.maven.plugins.source.SourceJarMojo
[INFO] 
[INFO] <<< maven-source-plugin:3.0.1:jar (attach-sources) < generate-sources @
org.apache.sling.installer.core <<<
[INFO] 
[INFO] --- maven-source-plugin:3.0.1:jar (attach-sources) @ org.apache.sling.installer.core
---
[INFO] Building jar: <https://builds.apache.org/job/sling-installer-core-1.7/ws/target/org.apache.sling.installer.core-3.8.4-sources.jar>
[INFO] 
[INFO] --- maven-site-plugin:3.5.1:attach-descriptor (attach-descriptor) @ org.apache.sling.installer.core
---
[INFO] 
[INFO] --- maven-bundle-plugin:3.2.0:baseline (baseline) @ org.apache.sling.installer.core
---
[INFO] artifact org.apache.sling:org.apache.sling.installer.core: checking for updates from
central
[INFO] Baseline Report - Generated by Apache Felix Maven Bundle Plugin on 2017-02-17T12:31Z
based on Bnd - see http://www.aqute.biz/Bnd/Bnd
[INFO] Comparing bundle org.apache.sling.installer.core version 3.8.4 to version 3.8.2
[INFO] 
[INFO]   PACKAGE_NAME                                       DELTA      CUR_VER    BASE_VER
  REC_VER    WARNINGS  
[INFO] = ================================================== ========== ========== ==========
========== ==========
[INFO]   org.apache.sling.installer.api                     unchanged  3.2.1      3.2.1  
   3.2.1      -         
[INFO] -----------------------------------------------------------------------------------------------------------
[INFO]   org.apache.sling.installer.api.event               unchanged  1.0.3      1.0.3  
   1.0.3      -         
[INFO] -----------------------------------------------------------------------------------------------------------
[INFO]   org.apache.sling.installer.api.info                unchanged  1.1.0      1.1.0  
   1.1.0      -         
[INFO] -----------------------------------------------------------------------------------------------------------
[INFO]   org.apache.sling.installer.api.jmx                 unchanged  1.0.3      1.0.3  
   1.0.3      -         
[INFO] -----------------------------------------------------------------------------------------------------------
[INFO]   org.apache.sling.installer.api.tasks               unchanged  1.4.0      1.4.0  
   1.4.0      -         
[INFO] -----------------------------------------------------------------------------------------------------------
[INFO] Baseline analysis complete, 0 error(s), 0 warning(s)
[INFO] 
[INFO] --- ianal-maven-plugin:1.0-alpha-1:verify-legal-files (default) @ org.apache.sling.installer.core
---
[INFO] Checking legal files in: org.apache.sling.installer.core-3.8.4.jar
[INFO] Checking legal files in: org.apache.sling.installer.core-3.8.4-sources.jar
[INFO] 
[INFO] --- apache-rat-plugin:0.11:check (default) @ org.apache.sling.installer.core ---
[INFO] 51 implicit excludes (use -debug for more details).
[INFO] Exclude: DEPENDENCIES
[INFO] Exclude: src/main/appended-resources/META-INF/*
[INFO] Exclude: velocity.log
[INFO] Exclude: target/*
[INFO] Exclude: README.md
[INFO] Exclude: maven-eclipse.xml
[INFO] Exclude: .*
[INFO] Exclude: .*/**
[INFO] Exclude: **/*.json
[INFO] Exclude: DEPENDENCIES
[INFO] Exclude: **/*.rej
[INFO] Exclude: hs_err_*.log
[INFO] 77 resources included (use -debug for more details)
[INFO] Rat check: Summary of files. Unapproved: 0 unknown: 0 generated: 0 approved: 77 licence.
[INFO] 
[INFO] --- maven-install-plugin:2.5.2:install (default-install) @ org.apache.sling.installer.core
---
[INFO] Installing <https://builds.apache.org/job/sling-installer-core-1.7/ws/target/org.apache.sling.installer.core-3.8.4.jar>
to /home/jenkins/jenkins-slave/maven-repositories/0/org/apache/sling/org.apache.sling.installer.core/3.8.4/org.apache.sling.installer.core-3.8.4.jar
[INFO] Installing <https://builds.apache.org/job/sling-installer-core-1.7/ws/pom.xml>
to /home/jenkins/jenkins-slave/maven-repositories/0/org/apache/sling/org.apache.sling.installer.core/3.8.4/org.apache.sling.installer.core-3.8.4.pom
[INFO] Installing <https://builds.apache.org/job/sling-installer-core-1.7/ws/target/org.apache.sling.installer.core-3.8.4-sources.jar>
to /home/jenkins/jenkins-slave/maven-repositories/0/org/apache/sling/org.apache.sling.installer.core/3.8.4/org.apache.sling.installer.core-3.8.4-sources.jar
[INFO] 
[INFO] --- maven-bundle-plugin:3.2.0:install (default-install) @ org.apache.sling.installer.core
---
[INFO] Local OBR update disabled (enable with -DobrRepository)
[INFO] 
[INFO] --- maven-deploy-plugin:2.8.2:deploy (default-deploy) @ org.apache.sling.installer.core
---
[INFO] Uploading: https://repository.apache.org/service/local/staging/deploy/maven2/org/apache/sling/org.apache.sling.installer.core/3.8.4/org.apache.sling.installer.core-3.8.4.jar
[INFO] Uploading: https://repository.apache.org/service/local/staging/deploy/maven2/org/apache/sling/org.apache.sling.installer.core/3.8.4/org.apache.sling.installer.core-3.8.4.pom
[WARNING] Encountered issue during deployment: Failed to deploy artifacts: Could not transfer
artifact org.apache.sling:org.apache.sling.installer.core:jar:3.8.4 from/to apache.releases.https
(https://repository.apache.org/service/local/staging/deploy/maven2): Failed to transfer file:
https://repository.apache.org/service/local/staging/deploy/maven2/org/apache/sling/org.apache.sling.installer.core/3.8.4/org.apache.sling.installer.core-3.8.4.jar.
Return code is: 401, ReasonPhrase: Unauthorized.
[INFO] Retrying deployment attempt 2 of 10
[INFO] Uploading: https://repository.apache.org/service/local/staging/deploy/maven2/org/apache/sling/org.apache.sling.installer.core/3.8.4/org.apache.sling.installer.core-3.8.4.jar
[INFO] Uploading: https://repository.apache.org/service/local/staging/deploy/maven2/org/apache/sling/org.apache.sling.installer.core/3.8.4/org.apache.sling.installer.core-3.8.4.pom
[WARNING] Encountered issue during deployment: Failed to deploy artifacts: Could not transfer
artifact org.apache.sling:org.apache.sling.installer.core:jar:3.8.4 from/to apache.releases.https
(https://repository.apache.org/service/local/staging/deploy/maven2): Failed to transfer file:
https://repository.apache.org/service/local/staging/deploy/maven2/org/apache/sling/org.apache.sling.installer.core/3.8.4/org.apache.sling.installer.core-3.8.4.jar.
Return code is: 401, ReasonPhrase: Unauthorized.
[INFO] Retrying deployment attempt 3 of 10
[INFO] Uploading: https://repository.apache.org/service/local/staging/deploy/maven2/org/apache/sling/org.apache.sling.installer.core/3.8.4/org.apache.sling.installer.core-3.8.4.jar
[INFO] Uploading: https://repository.apache.org/service/local/staging/deploy/maven2/org/apache/sling/org.apache.sling.installer.core/3.8.4/org.apache.sling.installer.core-3.8.4.pom
[WARNING] Encountered issue during deployment: Failed to deploy artifacts: Could not transfer
artifact org.apache.sling:org.apache.sling.installer.core:jar:3.8.4 from/to apache.releases.https
(https://repository.apache.org/service/local/staging/deploy/maven2): Failed to transfer file:
https://repository.apache.org/service/local/staging/deploy/maven2/org/apache/sling/org.apache.sling.installer.core/3.8.4/org.apache.sling.installer.core-3.8.4.jar.
Return code is: 401, ReasonPhrase: Unauthorized.
[INFO] Retrying deployment attempt 4 of 10
[INFO] Uploading: https://repository.apache.org/service/local/staging/deploy/maven2/org/apache/sling/org.apache.sling.installer.core/3.8.4/org.apache.sling.installer.core-3.8.4.jar
[INFO] Uploading: https://repository.apache.org/service/local/staging/deploy/maven2/org/apache/sling/org.apache.sling.installer.core/3.8.4/org.apache.sling.installer.core-3.8.4.pom
[WARNING] Encountered issue during deployment: Failed to deploy artifacts: Could not transfer
artifact org.apache.sling:org.apache.sling.installer.core:jar:3.8.4 from/to apache.releases.https
(https://repository.apache.org/service/local/staging/deploy/maven2): Failed to transfer file:
https://repository.apache.org/service/local/staging/deploy/maven2/org/apache/sling/org.apache.sling.installer.core/3.8.4/org.apache.sling.installer.core-3.8.4.jar.
Return code is: 401, ReasonPhrase: Unauthorized.
[INFO] Retrying deployment attempt 5 of 10
[INFO] Uploading: https://repository.apache.org/service/local/staging/deploy/maven2/org/apache/sling/org.apache.sling.installer.core/3.8.4/org.apache.sling.installer.core-3.8.4.jar
[INFO] Uploading: https://repository.apache.org/service/local/staging/deploy/maven2/org/apache/sling/org.apache.sling.installer.core/3.8.4/org.apache.sling.installer.core-3.8.4.pom
[WARNING] Encountered issue during deployment: Failed to deploy artifacts: Could not transfer
artifact org.apache.sling:org.apache.sling.installer.core:jar:3.8.4 from/to apache.releases.https
(https://repository.apache.org/service/local/staging/deploy/maven2): Failed to transfer file:
https://repository.apache.org/service/local/staging/deploy/maven2/org/apache/sling/org.apache.sling.installer.core/3.8.4/org.apache.sling.installer.core-3.8.4.jar.
Return code is: 401, ReasonPhrase: Unauthorized.
[INFO] Retrying deployment attempt 6 of 10
[INFO] Uploading: https://repository.apache.org/service/local/staging/deploy/maven2/org/apache/sling/org.apache.sling.installer.core/3.8.4/org.apache.sling.installer.core-3.8.4.jar
[INFO] Uploading: https://repository.apache.org/service/local/staging/deploy/maven2/org/apache/sling/org.apache.sling.installer.core/3.8.4/org.apache.sling.installer.core-3.8.4.pom
[WARNING] Encountered issue during deployment: Failed to deploy artifacts: Could not transfer
artifact org.apache.sling:org.apache.sling.installer.core:jar:3.8.4 from/to apache.releases.https
(https://repository.apache.org/service/local/staging/deploy/maven2): Failed to transfer file:
https://repository.apache.org/service/local/staging/deploy/maven2/org/apache/sling/org.apache.sling.installer.core/3.8.4/org.apache.sling.installer.core-3.8.4.jar.
Return code is: 401, ReasonPhrase: Unauthorized.
[INFO] Retrying deployment attempt 7 of 10
[INFO] Uploading: https://repository.apache.org/service/local/staging/deploy/maven2/org/apache/sling/org.apache.sling.installer.core/3.8.4/org.apache.sling.installer.core-3.8.4.jar
[INFO] Uploading: https://repository.apache.org/service/local/staging/deploy/maven2/org/apache/sling/org.apache.sling.installer.core/3.8.4/org.apache.sling.installer.core-3.8.4.pom
[WARNING] Encountered issue during deployment: Failed to deploy artifacts: Could not transfer
artifact org.apache.sling:org.apache.sling.installer.core:jar:3.8.4 from/to apache.releases.https
(https://repository.apache.org/service/local/staging/deploy/maven2): Failed to transfer file:
https://repository.apache.org/service/local/staging/deploy/maven2/org/apache/sling/org.apache.sling.installer.core/3.8.4/org.apache.sling.installer.core-3.8.4.jar.
Return code is: 401, ReasonPhrase: Unauthorized.
[INFO] Retrying deployment attempt 8 of 10
[INFO] Uploading: https://repository.apache.org/service/local/staging/deploy/maven2/org/apache/sling/org.apache.sling.installer.core/3.8.4/org.apache.sling.installer.core-3.8.4.jar
[INFO] Uploading: https://repository.apache.org/service/local/staging/deploy/maven2/org/apache/sling/org.apache.sling.installer.core/3.8.4/org.apache.sling.installer.core-3.8.4.pom
[WARNING] Encountered issue during deployment: Failed to deploy artifacts: Could not transfer
artifact org.apache.sling:org.apache.sling.installer.core:jar:3.8.4 from/to apache.releases.https
(https://repository.apache.org/service/local/staging/deploy/maven2): Failed to transfer file:
https://repository.apache.org/service/local/staging/deploy/maven2/org/apache/sling/org.apache.sling.installer.core/3.8.4/org.apache.sling.installer.core-3.8.4.jar.
Return code is: 401, ReasonPhrase: Unauthorized.
[INFO] Retrying deployment attempt 9 of 10
[INFO] Uploading: https://repository.apache.org/service/local/staging/deploy/maven2/org/apache/sling/org.apache.sling.installer.core/3.8.4/org.apache.sling.installer.core-3.8.4.jar
[INFO] Uploading: https://repository.apache.org/service/local/staging/deploy/maven2/org/apache/sling/org.apache.sling.installer.core/3.8.4/org.apache.sling.installer.core-3.8.4.pom
[WARNING] Encountered issue during deployment: Failed to deploy artifacts: Could not transfer
artifact org.apache.sling:org.apache.sling.installer.core:jar:3.8.4 from/to apache.releases.https
(https://repository.apache.org/service/local/staging/deploy/maven2): Failed to transfer file:
https://repository.apache.org/service/local/staging/deploy/maven2/org/apache/sling/org.apache.sling.installer.core/3.8.4/org.apache.sling.installer.core-3.8.4.jar.
Return code is: 401, ReasonPhrase: Unauthorized.
[INFO] Retrying deployment attempt 10 of 10
[INFO] Uploading: https://repository.apache.org/service/local/staging/deploy/maven2/org/apache/sling/org.apache.sling.installer.core/3.8.4/org.apache.sling.installer.core-3.8.4.jar
[INFO] Uploading: https://repository.apache.org/service/local/staging/deploy/maven2/org/apache/sling/org.apache.sling.installer.core/3.8.4/org.apache.sling.installer.core-3.8.4.pom
[JENKINS] Archiving disabled
[JENKINS] Archiving disabled
[INFO] ------------------------------------------------------------------------
[INFO] BUILD FAILURE
[INFO] ------------------------------------------------------------------------
[INFO] Total time: 01:23 min
[INFO] Finished at: 2017-02-17T12:32:06+00:00
[INFO] Final Memory: 48M/345M
[INFO] ------------------------------------------------------------------------
Waiting for Jenkins to finish collecting data
[ERROR] Failed to execute goal org.apache.maven.plugins:maven-deploy-plugin:2.8.2:deploy (default-deploy)
on project org.apache.sling.installer.core: Failed to deploy artifacts: Could not transfer
artifact org.apache.sling:org.apache.sling.installer.core:jar:3.8.4 from/to apache.releases.https
(https://repository.apache.org/service/local/staging/deploy/maven2): Failed to transfer file:
https://repository.apache.org/service/local/staging/deploy/maven2/org/apache/sling/org.apache.sling.installer.core/3.8.4/org.apache.sling.installer.core-3.8.4.jar.
Return code is: 401, ReasonPhrase: Unauthorized. -> [Help 1]
[ERROR] 
[ERROR] To see the full stack trace of the errors, re-run Maven with the -e switch.
[ERROR] Re-run Maven using the -X switch to enable full debug logging.
[ERROR] 
[ERROR] For more information about the errors and possible solutions, please read the following
articles:
[ERROR] [Help 1] http://cwiki.apache.org/confluence/display/MAVEN/MojoExecutionException
channel stopped
Recording test results
Found 55 test results

Mime
View raw message