sling-commits mailing list archives

Site index · List index
Message view « Date » · « Thread »
Top « Date » · « Thread »
From Apache Jenkins Server <jenk...@builds.apache.org>
Subject Build failed in Jenkins: sling-bundles-commons-fsclassloader-1.7 #7
Date Fri, 17 Feb 2017 21:01:13 GMT
See <https://builds.apache.org/job/sling-bundles-commons-fsclassloader-1.7/7/changes>

Changes:

[dklco] [maven-release-plugin] prepare for next development iteration

[dklco] [maven-release-plugin] prepare release org.apache.sling.commons.fsclassloader-1.0.6

[dklco] Updating to use Classloader 1.4.0

------------------------------------------
Started by an SCM change
[EnvInject] - Loading node environment variables.
Building remotely on H23 (ubuntu) in workspace <https://builds.apache.org/job/sling-bundles-commons-fsclassloader-1.7/ws/>
Updating https://svn.apache.org/repos/asf/sling/trunk/bundles/commons/fsclassloader at revision
'2017-02-17T21:00:15.474 +0000'
U         pom.xml
At revision 1783470

Parsing POMs
Modules changed, recalculating dependency graph
Established TCP socket on 32901
maven32-agent.jar already up to date
maven32-interceptor.jar already up to date
maven3-interceptor-commons.jar already up to date
[sling-bundles-commons-fsclassloader-1.7] $ /home/jenkins/tools/java/latest1.7/bin/java -Xmx2g
-Xms256m -cp /home/jenkins/jenkins-slave/maven32-agent.jar:/home/jenkins/tools/maven/apache-maven-3.3.9/boot/plexus-classworlds-2.5.2.jar:/home/jenkins/tools/maven/apache-maven-3.3.9/conf/logging
jenkins.maven3.agent.Maven32Main /home/jenkins/tools/maven/apache-maven-3.3.9 /home/jenkins/jenkins-slave/slave.jar
/home/jenkins/jenkins-slave/maven32-interceptor.jar /home/jenkins/jenkins-slave/maven3-interceptor-commons.jar
32901
<===[JENKINS REMOTING CAPACITY]===>   channel started
Executing Maven:  -B -f <https://builds.apache.org/job/sling-bundles-commons-fsclassloader-1.7/ws/pom.xml>
-Dmaven.repo.local=/home/jenkins/jenkins-slave/maven-repositories/1 -U clean deploy
[INFO] Scanning for projects...
[INFO]                                                                         
[INFO] ------------------------------------------------------------------------
[INFO] Building Apache Sling Commons FileSystem ClassLoader 1.0.7-SNAPSHOT
[INFO] ------------------------------------------------------------------------
[INFO] Downloading: https://repo.maven.apache.org/maven2/org/apache/sling/org.apache.sling.commons.classloader/1.4.0/org.apache.sling.commons.classloader-1.4.0.pom
[WARNING] The POM for org.apache.sling:org.apache.sling.commons.classloader:jar:1.4.0 is missing,
no dependency information available
[INFO] Downloading: https://repo.maven.apache.org/maven2/org/apache/sling/org.apache.sling.commons.classloader/1.4.0/org.apache.sling.commons.classloader-1.4.0.jar
[JENKINS] Archiving disabled
[JENKINS] Archiving disabled[INFO] ------------------------------------------------------------------------
[INFO] BUILD FAILURE
[INFO] ------------------------------------------------------------------------
[INFO] Total time: 3.802 s
[INFO] Finished at: 2017-02-17T21:01:10+00:00

[INFO] Final Memory: 17M/310M
[INFO] ------------------------------------------------------------------------
Waiting for Jenkins to finish collecting data[ERROR] Failed to execute goal on project org.apache.sling.commons.fsclassloader:
Could not resolve dependencies for project org.apache.sling:org.apache.sling.commons.fsclassloader:bundle:1.0.7-SNAPSHOT:
Could not find artifact org.apache.sling:org.apache.sling.commons.classloader:jar:1.4.0 in
central (https://repo.maven.apache.org/maven2) -> [Help 1]
[ERROR] 
[ERROR] To see the full stack trace of the errors, re-run Maven with the -e switch.
[ERROR] Re-run Maven using the -X switch to enable full debug logging.
[ERROR] 
[ERROR] For more information about the errors and possible solutions, please read the following
articles:
[ERROR] [Help 1] http://cwiki.apache.org/confluence/display/MAVEN/DependencyResolutionException

channel stopped
Recording test results
ERROR: Step ?Publish JUnit test result report? failed: Test reports were found but none of
them are new. Did tests run? 
For example, <https://builds.apache.org/job/sling-bundles-commons-fsclassloader-1.7/ws/target/surefire-reports/TEST-org.apache.sling.commons.fsclassloader.impl.FSClassLoaderWebConsoleTest.xml>
is 13 min old



Mime
View raw message