sling-commits mailing list archives

Site index · List index
Message view « Date » · « Thread »
Top « Date » · « Thread »
From Apache Jenkins Server <jenk...@builds.apache.org>
Subject Build failed in Jenkins: sling-launchpad-builder-1.8 #2087
Date Tue, 31 Jan 2017 22:50:24 GMT
See <https://builds.apache.org/job/sling-launchpad-builder-1.8/2087/>

------------------------------------------
[...truncated 80 lines...]
[INFO] No sources to compile
[INFO] 
[INFO] --- maven-resources-plugin:2.7:testResources (default-testResources) @ org.apache.sling.launchpad
---
[INFO] Using 'UTF-8' encoding to copy filtered resources.
[INFO] skip non existing resourceDirectory <https://builds.apache.org/job/sling-launchpad-builder-1.8/ws/src/test/resources>
[INFO] Copying 3 resources
[INFO] Copying 3 resources
[INFO] 
[INFO] --- maven-compiler-plugin:3.5.1:testCompile (default-testCompile) @ org.apache.sling.launchpad
---
[INFO] Changes detected - recompiling the module!
[INFO] Compiling 3 source files to <https://builds.apache.org/job/sling-launchpad-builder-1.8/ws/target/test-classes>
[INFO] 
[INFO] --- maven-surefire-plugin:2.18.1:test (default-test) @ org.apache.sling.launchpad ---
[JENKINS] Recording test results
[INFO] 
[INFO] --- animal-sniffer-maven-plugin:1.15:check (default) @ org.apache.sling.launchpad ---
[INFO] Checking unresolved references to org.codehaus.mojo.signature:java18:1.0
[INFO] 
[INFO] --- slingstart-maven-plugin:1.7.0:prepare-package (default-prepare-package) @ org.apache.sling.launchpad
---
[INFO] 
[INFO] --- slingstart-maven-plugin:1.7.0:attach-slingfeature (default-attach-slingfeature)
@ org.apache.sling.launchpad ---
[INFO] 
[INFO] --- slingstart-maven-plugin:1.7.0:package (default-package) @ org.apache.sling.launchpad
---
[INFO] Packaging standalone jar...
[INFO] Building zip: <https://builds.apache.org/job/sling-launchpad-builder-1.8/ws/target/org.apache.sling.launchpad-9-SNAPSHOT.jar>
[INFO] Packaging webapp...
[INFO] Building zip: <https://builds.apache.org/job/sling-launchpad-builder-1.8/ws/target/org.apache.sling.launchpad-9-SNAPSHOT.war>
[INFO] 
[INFO] >>> maven-source-plugin:3.0.1:jar (attach-sources) > generate-sources @
org.apache.sling.launchpad >>>
[INFO] 
[INFO] --- maven-enforcer-plugin:1.4.1:enforce (enforce-java) @ org.apache.sling.launchpad
---
[INFO] 
[INFO] --- maven-antrun-plugin:1.8:run (set-bundle-required-execution-environment) @ org.apache.sling.launchpad
---
[INFO] Executing tasks

main:
Setting Bundle-RequiredExecutionEnvironment=JavaSE-1.8 from sling.java.version=8
[INFO] Executed tasks
[WARNING] Failed to getClass for org.apache.maven.plugins.source.SourceJarMojo
[INFO] 
[INFO] <<< maven-source-plugin:3.0.1:jar (attach-sources) < generate-sources @
org.apache.sling.launchpad <<<
[INFO] 
[INFO] --- maven-source-plugin:3.0.1:jar (attach-sources) @ org.apache.sling.launchpad ---
[INFO] Building jar: <https://builds.apache.org/job/sling-launchpad-builder-1.8/ws/target/org.apache.sling.launchpad-9-SNAPSHOT-sources.jar>
[INFO] 
[INFO] --- maven-site-plugin:3.5.1:attach-descriptor (attach-descriptor) @ org.apache.sling.launchpad
---
[INFO] 
[INFO] --- slingstart-maven-plugin:1.7.0:start (start-container) @ org.apache.sling.launchpad
---
[INFO] Using launchpad jar being generated as this project's primary artifact: '<https://builds.apache.org/job/sling-launchpad-builder-1.8/ws/target/org.apache.sling.launchpad-9-SNAPSHOT.jar'!>
[INFO] Starting Launchpad _-42094...
Java HotSpot(TM) 64-Bit Server VM warning: ignoring option MaxPermSize=256m; support was removed
in 8.0
-------------------------------------------------------------------
Slingstart application: <https://builds.apache.org/job/sling-launchpad-builder-1.8/ws/target/_-42094/org.apache.sling.launchpad-9-SNAPSHOT.jar>
Main class: org.apache.sling.launchpad.app.Main
Listener Port: 39766
Arguments: [-p, 42094, -j, 48587]
-------------------------------------------------------------------
31.01.2017 22:49:54.049 *INFO * [main] Setting sling.home=sling (default)
31.01.2017 22:49:54.052 *INFO * [main] Starting Apache Sling in <https://builds.apache.org/job/sling-launchpad-builder-1.8/ws/target/_-42094/sling>
31.01.2017 22:49:54.079 *INFO * [main] Sling  Extension Lib Home : <https://builds.apache.org/job/sling-launchpad-builder-1.8/ws/target/_-42094/sling/ext>
31.01.2017 22:49:54.080 *INFO * [main] Checking launcher JAR in folder <https://builds.apache.org/job/sling-launchpad-builder-1.8/ws/target/_-42094/sling>
31.01.2017 22:49:54.110 *INFO * [main] Installing new launcher: jar:<https://builds.apache.org/job/sling-launchpad-builder-1.8/ws/target/_-42094/org.apache.sling.launchpad-9-SNAPSHOT.jar!/resources/org.apache.sling.launchpad.base.jar,>
5.6.1.2_6_15-SNAPSHOT, Last-Modified:Fri Jan 06 13:02:59 UTC 2017 (org.apache.sling.launchpad.base.jar.1485902994102)
31.01.2017 22:49:54.111 *INFO * [main] Loading launcher class org.apache.sling.launchpad.base.app.MainDelegate
from org.apache.sling.launchpad.base.jar.1485902994102
31.01.2017 22:49:54.112 *INFO * [main] External Libs Home (ext) is null or does not exists.
31.01.2017 22:49:54.125 *INFO * [main] Setting sling.launchpad=<https://builds.apache.org/job/sling-launchpad-builder-1.8/ws/target/_-42094/sling>
31.01.2017 22:49:54.126 *INFO * [main] Setting org.osgi.service.http.port=42094
31.01.2017 22:49:54.126 *INFO * [main] Setting sling.control.socket=48587
31.01.2017 22:49:54.126 *INFO * [main] Starting launcher ...
31.01.2017 22:49:54.136 *INFO * [main] HTTP server port: 42094
31.01.2017 22:49:54.967 *INFO* [FelixStartLevel] org.apache.sling.settings.impl.SlingSettingsServiceImpl
Read Sling ID null from file <https://builds.apache.org/job/sling-launchpad-builder-1.8/ws/target/_-42094/sling/felix/bundle4/data/sling.id.file>
31.01.2017 22:49:54.972 *INFO* [FelixStartLevel] org.apache.sling.settings.impl.SlingSettingsServiceImpl
Created new Sling ID bd02ab98-8fbb-4987-b831-bcf2b4f85120
31.01.2017 22:49:54.997 *INFO* [FelixStartLevel] org.apache.sling.settings.impl.SlingSettingsServiceImpl
Active run modes: [oak_tar]
31.01.2017 22:49:55.022 *INFO* [OsgiInstallerImpl] org.apache.sling.installer.core.impl.OsgiInstallerImpl
Apache Sling OSGi Installer Service started.
31.01.2017 22:49:55.059 *INFO* [FelixStartLevel] org.apache.sling.commons.logservice Service
[org.apache.sling.commons.logservice.internal.LogServiceFactory,17, [org.osgi.service.log.LogService]]
ServiceEvent REGISTERED
31.01.2017 22:49:55.061 *INFO* [FelixStartLevel] org.apache.sling.commons.logservice Service
[org.apache.sling.commons.logservice.internal.LogReaderServiceFactory,18, [org.osgi.service.log.LogReaderService]]
ServiceEvent REGISTERED
31.01.2017 22:49:55.062 *INFO* [FelixStartLevel] org.apache.sling.commons.logservice BundleEvent
STARTED
31.01.2017 22:49:55.066 *INFO* [FelixStartLevel] jcl.over.slf4j BundleEvent RESOLVED
31.01.2017 22:49:55.066 *INFO* [FelixStartLevel] jcl.over.slf4j BundleEvent STARTING
31.01.2017 22:49:55.066 *INFO* [FelixStartLevel] jcl.over.slf4j BundleEvent STARTED
31.01.2017 22:49:55.069 *INFO* [FelixStartLevel] org.apache.sling.launchpad.installer BundleEvent
RESOLVED
31.01.2017 22:49:55.069 *INFO* [FelixStartLevel] org.apache.sling.launchpad.installer BundleEvent
STARTING
31.01.2017 22:49:55.072 *INFO* [FelixStartLevel] org.apache.sling.launchpad.installer Service
[Apache Sling Launchpad Startup Listener,19, [org.apache.sling.installer.api.event.InstallationListener]]
ServiceEvent REGISTERED
31.01.2017 22:49:55.080 *INFO* [FelixStartLevel] org.apache.sling.launchpad.installer.impl.LaunchpadConfigInstaller
Activating launchpad config installer, configuration path=resources/config, install path=resources/install
31.01.2017 22:49:55.473 *INFO* [FelixStartLevel] org.apache.sling.launchpad.installer.impl.LaunchpadConfigInstaller
154 resources registered with OsgiInstaller
31.01.2017 22:49:55.473 *INFO* [FelixStartLevel] org.apache.sling.launchpad.installer BundleEvent
STARTED
31.01.2017 22:49:55.476 *INFO* [FelixStartLevel] org.apache.sling.javax.activation BundleEvent
RESOLVED
31.01.2017 22:49:55.476 *INFO* [FelixStartLevel] org.apache.sling.javax.activation BundleEvent
STARTING
31.01.2017 22:49:55.484 *INFO* [FelixStartLevel] org.apache.sling.javax.activation BundleEvent
STARTED
31.01.2017 22:49:55.484 *INFO* [FelixStartLevel] org.apache.felix.configadmin BundleEvent
STARTING
31.01.2017 22:49:55.506 *INFO* [FelixStartLevel] org.apache.felix.configadmin Service [org.apache.felix.cm.file.FilePersistenceManager,20,
[org.apache.felix.cm.PersistenceManager]] ServiceEvent REGISTERED
31.01.2017 22:49:55.510 *INFO* [FelixStartLevel] org.apache.sling.settings Service [org.apache.sling.settings.impl.SlingSettingsServiceImpl,22,
[org.osgi.service.cm.ManagedService]] ServiceEvent REGISTERED
31.01.2017 22:49:55.510 *INFO* [FelixStartLevel] org.apache.felix.configadmin Service [org.apache.felix.cm.ConfigurationAdmin,21,
[org.osgi.service.cm.ConfigurationAdmin]] ServiceEvent REGISTERED
31.01.2017 22:49:55.514 *INFO* [FelixStartLevel] org.apache.sling.installer.factory.configuration
Service [Apache Sling Configuration Install Task Factory,23, [org.apache.sling.installer.api.tasks.InstallTaskFactory,
org.osgi.service.cm.ConfigurationListener, org.apache.sling.installer.api.tasks.ResourceTransformer]]
ServiceEvent REGISTERED
31.01.2017 22:49:55.521 *INFO* [FelixStartLevel] org.apache.felix.configadmin BundleEvent
STARTED
31.01.2017 22:49:55.524 *INFO* [FelixStartLevel] org.apache.geronimo.specs.geronimo-atinject_1.0_spec
BundleEvent RESOLVED
31.01.2017 22:49:55.524 *INFO* [FelixStartLevel] org.apache.geronimo.specs.geronimo-atinject_1.0_spec
BundleEvent STARTING
31.01.2017 22:49:55.528 *INFO* [FelixStartLevel] org.apache.geronimo.specs.geronimo-atinject_1.0_spec
BundleEvent STARTED
31.01.2017 22:49:55.530 *INFO* [FelixStartLevel] log4j.over.slf4j BundleEvent RESOLVED
31.01.2017 22:49:55.531 *INFO* [FelixStartLevel] log4j.over.slf4j BundleEvent STARTING
31.01.2017 22:49:55.531 *INFO* [FelixStartLevel] log4j.over.slf4j BundleEvent STARTED
31.01.2017 22:49:55.534 *INFO* [FelixStartLevel] org.apache.aries.util BundleEvent RESOLVED
31.01.2017 22:49:55.534 *INFO* [FelixStartLevel] org.apache.aries.util BundleEvent STARTING
31.01.2017 22:49:55.534 *INFO* [FelixStartLevel] org.apache.aries.util BundleEvent STARTED
31.01.2017 22:49:55.534 *INFO* [FelixStartLevel] org.apache.sling.commons.log BundleEvent
STARTING
31.01.2017 22:49:55.561 *INFO* [FelixStartLevel] org.apache.sling.commons.log Service [org.apache.sling.commons.log.LogManager,24,
[org.osgi.service.cm.ManagedService]] ServiceEvent REGISTERED
31.01.2017 22:49:55.565 *INFO* [FelixStartLevel] org.apache.sling.commons.log Service [org.apache.sling.commons.log.LogManager.factory.writer,25,
[org.osgi.service.cm.ManagedServiceFactory]] ServiceEvent REGISTERED
31.01.2017 22:49:55.566 *INFO* [FelixStartLevel] org.apache.sling.commons.log Service [org.apache.sling.commons.log.LogManager.factory.config,26,
[org.osgi.service.cm.ManagedServiceFactory]] ServiceEvent REGISTERED
31.01.2017 22:49:55.570 *INFO* [FelixStartLevel] org.apache.sling.commons.log Service [Sling
Log Panel Support,27, [org.apache.sling.commons.log.logback.webconsole.LogPanel]] ServiceEvent
REGISTERED
31.01.2017 22:49:55.572 *INFO* [FelixStartLevel] org.apache.sling.commons.log Service [Sling
Log Configuration Printer,28, [org.apache.sling.commons.log.logback.internal.SlingConfigurationPrinter]]
ServiceEvent REGISTERED
31.01.2017 22:49:55.573 *INFO* [FelixStartLevel] org.apache.sling.commons.log Service [Sling
Log Reset Event Handler,29, [org.osgi.service.event.EventHandler]] ServiceEvent REGISTERED
31.01.2017 22:49:55.629 *INFO * [main] Startup completed
[INFO] Started Launchpad _-42094 [null, 42094]
[INFO] 
[INFO] --- maven-failsafe-plugin:2.18.1:integration-test (default) @ org.apache.sling.launchpad
---
[INFO] Failsafe report directory: <https://builds.apache.org/job/sling-launchpad-builder-1.8/ws/target/failsafe-reports>

-------------------------------------------------------
 T E S T S
-------------------------------------------------------
SUREFIRE-859: Java HotSpot(TM) 64-Bit Server VM warning: INFO: os::commit_memory(0x00000006c5200000,
176160768, 0) failed; error='Cannot allocate memory' (errno=12)
#
# There is insufficient memory for the Java Runtime Environment to continue.
# Native memory allocation (mmap) failed to map 176160768 bytes for committing reserved memory.
# An error report file with more information is saved as:
# <https://builds.apache.org/job/sling-launchpad-builder-1.8/ws/hs_err_pid8569.log>

Results :

Tests run: 0, Failures: 0, Errors: 0, Skipped: 0

[JENKINS] Recording test results
[JENKINS] Archiving disabled
31.01.2017 22:50:15.342 *INFO* [OsgiInstallerImpl] org.apache.sling.audit.osgi.installer Installed
configuration org.apache.sling.serviceusermapping.impl.ServiceUserMapperImpl.amended.06d4a52c-0752-4729-8b25-601afde35f27
from resource TaskResource(url=launchpad:resources/config/org.apache.sling.serviceusermapping.impl.ServiceUserMapperImpl.amended-i18n.config,
entity=config:org.apache.sling.serviceusermapping.impl.ServiceUserMapperImpl.amended.i18n,
state=INSTALL, attributes=[org.apache.sling.installer.api.tasks.ResourceTransformer=:12:23:,
service.factoryPid=org.apache.sling.serviceusermapping.impl.ServiceUserMapperImpl.amended,
service.pid=i18n], digest=5ca453becbd0de7378d7d5707823f9a8)
31.01.2017 22:50:15.353 *INFO* [OsgiInstallerImpl] org.apache.sling.audit.osgi.installer Installed
configuration org.apache.sling.serviceusermapping.impl.ServiceUserMapperImpl.amended.e7c9817e-1092-48c1-adc6-57c7882cdead
from resource TaskResource(url=launchpad:resources/config/org.apache.sling.serviceusermapping.impl.ServiceUserMapperImpl.amended-jcr-install.config,
entity=config:org.apache.sling.serviceusermapping.impl.ServiceUserMapperImpl.amended.jcr-install,
state=INSTALL, attributes=[org.apache.sling.installer.api.tasks.ResourceTransformer=:12:23:,
service.factoryPid=org.apache.sling.serviceusermapping.impl.ServiceUserMapperImpl.amended,
service.pid=jcr-install], digest=c54b829f7b7740a799d99e251af020c9)
31.01.2017 22:50:15.355 *INFO* [OsgiInstallerImpl] org.apache.sling.audit.osgi.installer Installed
configuration org.apache.sling.serviceusermapping.impl.ServiceUserMapperImpl.amended.038f6074-f538-4d45-92a4-d5b069bb66d2
from resource TaskResource(url=launchpad:resources/config/org.apache.sling.serviceusermapping.impl.ServiceUserMapperImpl.amended-observation.config,
entity=config:org.apache.sling.serviceusermapping.impl.ServiceUserMapperImpl.amended.observation,
state=INSTALL, attributes=[org.apache.sling.installer.api.tasks.ResourceTransformer=:12:23:,
service.factoryPid=org.apache.sling.serviceusermapping.impl.ServiceUserMapperImpl.amended,
service.pid=observation], digest=b358fca04fc5775b5fee0983520f157b)
31.01.2017 22:50:15.378 *INFO* [OsgiInstallerImpl] org.apache.sling.audit.osgi.installer Installed
configuration org.apache.sling.serviceusermapping.impl.ServiceUserMapperImpl.amended.04e69944-8aea-4bd1-97ae-509e6f713c2d
from resource TaskResource(url=launchpad:resources/config/org.apache.sling.serviceusermapping.impl.ServiceUserMapperImpl.amended-resourceresolver.config,
entity=config:org.apache.sling.serviceusermapping.impl.ServiceUserMapperImpl.amended.resourceresolver,
state=INSTALL, attributes=[org.apache.sling.installer.api.tasks.ResourceTransformer=:12:23:,
service.factoryPid=org.apache.sling.serviceusermapping.impl.ServiceUserMapperImpl.amended,
service.pid=resourceresolver], digest=d317bcbc20315e21bdbb0480199d7a55)
31.01.2017 22:50:15.379 *INFO* [OsgiInstallerImpl] org.apache.sling.audit.osgi.installer Installed
configuration org.apache.sling.serviceusermapping.impl.ServiceUserMapperImpl.amended.fbef76b6-bc99-44f7-b9a9-09031f6b3f93
from resource TaskResource(url=launchpad:resources/config/org.apache.sling.serviceusermapping.impl.ServiceUserMapperImpl.amended-scripting.config,
entity=config:org.apache.sling.serviceusermapping.impl.ServiceUserMapperImpl.amended.scripting,
state=INSTALL, attributes=[org.apache.sling.installer.api.tasks.ResourceTransformer=:12:23:,
service.factoryPid=org.apache.sling.serviceusermapping.impl.ServiceUserMapperImpl.amended,
service.pid=scripting], digest=1a211fcd563fb7b2b0f8ea68ce4cef92)
31.01.2017 22:50:15.414 *INFO* [OsgiInstallerImpl] org.apache.sling.audit.osgi.installer Installed
configuration org.apache.sling.serviceusermapping.impl.ServiceUserMapperImpl.amended.bc553874-4a9d-4d20-86f3-258a3e2d8456
from resource TaskResource(url=launchpad:resources/config/org.apache.sling.serviceusermapping.impl.ServiceUserMapperImpl.amended-xss.config,
entity=config:org.apache.sling.serviceusermapping.impl.ServiceUserMapperImpl.amended.xss,
state=INSTALL, attributes=[org.apache.sling.installer.api.tasks.ResourceTransformer=:12:23:,
service.factoryPid=org.apache.sling.serviceusermapping.impl.ServiceUserMapperImpl.amended,
service.pid=xss], digest=3ca37545204425ef337f981e2f6ab7f2)
[JENKINS] Archiving disabled
[INFO] ------------------------------------------------------------------------
[INFO] BUILD FAILURE
[INFO] ------------------------------------------------------------------------
[INFO] Total time: 01:11 min
[INFO] Finished at: 2017-01-31T22:50:16+00:00
[INFO] Final Memory: 61M/903M
[INFO] ------------------------------------------------------------------------
Waiting for Jenkins to finish collecting data
[ERROR] Failed to execute goal org.apache.maven.plugins:maven-failsafe-plugin:2.18.1:integration-test
(default) on project org.apache.sling.launchpad: Execution default of goal org.apache.maven.plugins:maven-failsafe-plugin:2.18.1:integration-test
failed: The forked VM terminated without properly saying goodbye. VM crash or System.exit
called?
[ERROR] Command was /bin/sh -c cd <https://builds.apache.org/job/sling-launchpad-builder-1.8/ws/>
&& /usr/local/asfpackages/java/jdk1.8.0_102/jre/bin/java -jar <https://builds.apache.org/job/sling-launchpad-builder-1.8/ws/target/surefire/surefirebooter6394695596770860283.jar>
<https://builds.apache.org/job/sling-launchpad-builder-1.8/ws/target/surefire/surefire8273791255271706093tmp>
<https://builds.apache.org/job/sling-launchpad-builder-1.8/ws/target/surefire/surefire_02103896298843771832tmp>
[ERROR] -> [Help 1]
[ERROR] 
[ERROR] To see the full stack trace of the errors, re-run Maven with the -e switch.
[ERROR] Re-run Maven using the -X switch to enable full debug logging.
[ERROR] 
[ERROR] For more information about the errors and possible solutions, please read the following
articles:
[ERROR] [Help 1] http://cwiki.apache.org/confluence/display/MAVEN/PluginExecutionException
channel stopped
Terminating launchpad _-42094
31.01.2017 22:50:20.026 *INFO * [Apache Sling Terminator] Java VM is shutting down
31.01.2017 22:50:20.026 *INFO * [Apache Sling Terminator] Stopping Apache Sling
Archiving artifacts
ERROR: Failed to archive {target/_-42094/sling/logs/error.log=target/_-42094/sling/logs/error.log}
due to internal error; falling back to full archiving
java.lang.IllegalStateException: checksum mismatch after transfer (3688780354311565872 vs.
3147230915); /x1/jenkins/jenkins-home/jobs/sling-launchpad-builder-1.8/builds/2087/archive/target/_-42094/sling/logs/error.log
may be corrupted
	at jsync.protocol.FileSequenceReader.read(FileSequenceReader.java:45)
	at com.cloudbees.jenkins.plugins.jsync.archiver.JSyncArtifactManager.remoteSync(JSyncArtifactManager.java:158)
	at com.cloudbees.jenkins.plugins.jsync.archiver.JSyncArtifactManager.archive(JSyncArtifactManager.java:76)
	at hudson.tasks.ArtifactArchiver.perform(ArtifactArchiver.java:238)
	at hudson.tasks.BuildStepCompatibilityLayer.perform(BuildStepCompatibilityLayer.java:78)
	at hudson.tasks.BuildStepMonitor$1.perform(BuildStepMonitor.java:20)
	at hudson.model.AbstractBuild$AbstractBuildExecution.perform(AbstractBuild.java:779)
	at hudson.model.AbstractBuild$AbstractBuildExecution.performAllBuildSteps(AbstractBuild.java:720)
	at hudson.maven.MavenModuleSetBuild$MavenModuleSetBuildExecution.post2(MavenModuleSetBuild.java:1047)
	at hudson.model.AbstractBuild$AbstractBuildExecution.post(AbstractBuild.java:665)
	at hudson.model.Run.execute(Run.java:1766)
	at hudson.maven.MavenModuleSetBuild.run(MavenModuleSetBuild.java:531)
	at hudson.model.ResourceController.execute(ResourceController.java:98)
	at hudson.model.Executor.run(Executor.java:410)
ERROR: Failed to archive artifacts: **/logs/error.log
java.io.IOException: java.io.IOException: Failed to extract <https://builds.apache.org/job/sling-launchpad-builder-1.8/ws/transfer>
of 1 files
	at hudson.FilePath.readFromTar(FilePath.java:2328)
	at hudson.FilePath.copyRecursiveTo(FilePath.java:2237)
	at jenkins.model.StandardArtifactManager.archive(StandardArtifactManager.java:61)
	at com.cloudbees.jenkins.plugins.jsync.archiver.JSyncArtifactManager.archive(JSyncArtifactManager.java:80)
	at hudson.tasks.ArtifactArchiver.perform(ArtifactArchiver.java:238)
	at hudson.tasks.BuildStepCompatibilityLayer.perform(BuildStepCompatibilityLayer.java:78)
	at hudson.tasks.BuildStepMonitor$1.perform(BuildStepMonitor.java:20)
	at hudson.model.AbstractBuild$AbstractBuildExecution.perform(AbstractBuild.java:779)
	at hudson.model.AbstractBuild$AbstractBuildExecution.performAllBuildSteps(AbstractBuild.java:720)
	at hudson.maven.MavenModuleSetBuild$MavenModuleSetBuildExecution.post2(MavenModuleSetBuild.java:1047)
	at hudson.model.AbstractBuild$AbstractBuildExecution.post(AbstractBuild.java:665)
	at hudson.model.Run.execute(Run.java:1766)
	at hudson.maven.MavenModuleSetBuild.run(MavenModuleSetBuild.java:531)
	at hudson.model.ResourceController.execute(ResourceController.java:98)
	at hudson.model.Executor.run(Executor.java:410)
Caused by: java.io.EOFException: Unexpected end of ZLIB input stream
	at com.jcraft.jzlib.InflaterInputStream.fill(InflaterInputStream.java:186)
	at com.jcraft.jzlib.InflaterInputStream.read(InflaterInputStream.java:106)
	at org.apache.commons.compress.archivers.tar.TarArchiveInputStream.read(TarArchiveInputStream.java:614)
	at java.io.InputStream.read(InputStream.java:101)
	at org.apache.commons.io.IOUtils.copyLarge(IOUtils.java:1792)
	at org.apache.commons.io.IOUtils.copyLarge(IOUtils.java:1769)
	at org.apache.commons.io.IOUtils.copy(IOUtils.java:1744)
	at hudson.util.IOUtils.copy(IOUtils.java:40)
	at hudson.FilePath.readFromTar(FilePath.java:2318)
	... 14 more

	at hudson.FilePath.copyRecursiveTo(FilePath.java:2244)
	at jenkins.model.StandardArtifactManager.archive(StandardArtifactManager.java:61)
	at com.cloudbees.jenkins.plugins.jsync.archiver.JSyncArtifactManager.archive(JSyncArtifactManager.java:80)
	at hudson.tasks.ArtifactArchiver.perform(ArtifactArchiver.java:238)
	at hudson.tasks.BuildStepCompatibilityLayer.perform(BuildStepCompatibilityLayer.java:78)
	at hudson.tasks.BuildStepMonitor$1.perform(BuildStepMonitor.java:20)
	at hudson.model.AbstractBuild$AbstractBuildExecution.perform(AbstractBuild.java:779)
	at hudson.model.AbstractBuild$AbstractBuildExecution.performAllBuildSteps(AbstractBuild.java:720)
	at hudson.maven.MavenModuleSetBuild$MavenModuleSetBuildExecution.post2(MavenModuleSetBuild.java:1047)
	at hudson.model.AbstractBuild$AbstractBuildExecution.post(AbstractBuild.java:665)
	at hudson.model.Run.execute(Run.java:1766)
	at hudson.maven.MavenModuleSetBuild.run(MavenModuleSetBuild.java:531)
	at hudson.model.ResourceController.execute(ResourceController.java:98)
	at hudson.model.Executor.run(Executor.java:410)
Caused by: java.util.concurrent.ExecutionException: java.io.IOException: This archives contains
unclosed entries.
	at hudson.remoting.Channel$2.adapt(Channel.java:813)
	at hudson.remoting.Channel$2.adapt(Channel.java:808)
	at hudson.remoting.FutureAdapter.get(FutureAdapter.java:59)
	at hudson.FilePath.copyRecursiveTo(FilePath.java:2240)
	... 13 more
Caused by: java.io.IOException: This archives contains unclosed entries.
	at org.apache.commons.compress.archivers.tar.TarArchiveOutputStream.finish(TarArchiveOutputStream.java:225)
	at org.apache.commons.compress.archivers.tar.TarArchiveOutputStream.close(TarArchiveOutputStream.java:241)
	at hudson.util.io.TarArchiver.close(TarArchiver.java:111)
	at hudson.FilePath.writeToTar(FilePath.java:2291)
	at hudson.FilePath.access$2100(FilePath.java:195)
	at hudson.FilePath$45.invoke(FilePath.java:2230)
	at hudson.FilePath$45.invoke(FilePath.java:2226)
	at hudson.FilePath$FileCallableWrapper.call(FilePath.java:2772)
	at hudson.remoting.UserRequest.perform(UserRequest.java:153)
	at hudson.remoting.UserRequest.perform(UserRequest.java:50)
	at hudson.remoting.Request$2.run(Request.java:332)
	at hudson.remoting.InterceptingExecutorService$1.call(InterceptingExecutorService.java:68)
	at java.util.concurrent.FutureTask.run(FutureTask.java:262)
	at java.util.concurrent.ThreadPoolExecutor.runWorker(ThreadPoolExecutor.java:1145)
	at java.util.concurrent.ThreadPoolExecutor$Worker.run(ThreadPoolExecutor.java:615)
	at java.lang.Thread.run(Thread.java:745)
	at ......remote call to ubuntu-eu2(Native Method)
	at hudson.remoting.Channel.attachCallSiteStackTrace(Channel.java:1416)
	at hudson.remoting.UserResponse.retrieve(UserRequest.java:253)
	at hudson.remoting.Channel$2.adapt(Channel.java:811)
	... 16 more
Recording test results

Mime
View raw message