sling-commits mailing list archives

Site index · List index
Message view « Date » · « Thread »
Top « Date » · « Thread »
From Apache Jenkins Server <jenk...@builds.apache.org>
Subject Build failed in Jenkins: sling-testing-junit-teleporter-1.8 #4
Date Fri, 06 Jan 2017 10:34:14 GMT
See <https://builds.apache.org/job/sling-testing-junit-teleporter-1.8/4/changes>

Changes:

[dulvac] tmp: non-snapshot dep for release

------------------------------------------
Started by an SCM change
[EnvInject] - Loading node environment variables.
Building remotely on ubuntu-us1 (ubuntu) in workspace <https://builds.apache.org/job/sling-testing-junit-teleporter-1.8/ws/>
Updating https://svn.apache.org/repos/asf/sling/trunk/testing/junit/teleporter at revision
'2017-01-06T10:33:19.351 +0000'
U         pom.xml
At revision 1777579

Parsing POMs
Modules changed, recalculating dependency graph
Established TCP socket on 59294
maven32-agent.jar already up to date
maven32-interceptor.jar already up to date
maven3-interceptor-commons.jar already up to date
[sling-testing-junit-teleporter-1.8] $ /home/jenkins/tools/java/latest1.8/bin/java -Xmx2g
-Xms256m -XX:MaxPermSize=512m -cp /home/jenkins/jenkins-slave/maven32-agent.jar:/home/jenkins/tools/maven/apache-maven-3.3.9/boot/plexus-classworlds-2.5.2.jar:/home/jenkins/tools/maven/apache-maven-3.3.9/conf/logging
jenkins.maven3.agent.Maven32Main /home/jenkins/tools/maven/apache-maven-3.3.9 /home/jenkins/jenkins-slave/slave.jar
/home/jenkins/jenkins-slave/maven32-interceptor.jar /home/jenkins/jenkins-slave/maven3-interceptor-commons.jar
59294
Java HotSpot(TM) 64-Bit Server VM warning: ignoring option MaxPermSize=512m; support was removed
in 8.0
<===[JENKINS REMOTING CAPACITY]===>   channel started
Executing Maven:  -B -f <https://builds.apache.org/job/sling-testing-junit-teleporter-1.8/ws/pom.xml>
-Dmaven.repo.local=/home/jenkins/jenkins-slave/maven-repositories/0 -U clean verify
[INFO] Scanning for projects...
[INFO]                                                                         
[INFO] ------------------------------------------------------------------------
[INFO] Building Apache Sling JUnit Tests Teleporter 1.0.9-SNAPSHOT
[INFO] ------------------------------------------------------------------------
[INFO] Downloading: https://repo.maven.apache.org/maven2/org/apache/sling/org.apache.sling.junit.core/1.0.23/org.apache.sling.junit.core-1.0.23.pom
[WARNING] The POM for org.apache.sling:org.apache.sling.junit.core:jar:1.0.23 is missing,
no dependency information available
[INFO] Downloading: https://repo.maven.apache.org/maven2/org/apache/sling/org.apache.sling.testing.clients/1.0.1/org.apache.sling.testing.clients-1.0.1.pom
[WARNING] The POM for org.apache.sling:org.apache.sling.testing.clients:jar:1.0.1 is missing,
no dependency information available
[INFO] Downloading: https://repo.maven.apache.org/maven2/org/apache/sling/org.apache.sling.junit.core/1.0.23/org.apache.sling.junit.core-1.0.23.jar
[INFO] Downloading: https://repo.maven.apache.org/maven2/org/apache/sling/org.apache.sling.testing.clients/1.0.1/org.apache.sling.testing.clients-1.0.1.jar
[JENKINS] Archiving disabled
[JENKINS] Archiving disabled
[INFO] ------------------------------------------------------------------------
[INFO] BUILD FAILURE
[INFO] ------------------------------------------------------------------------
[INFO] Total time: 5.775 s
[INFO] Finished at: 2017-01-06T10:34:19+00:00
[INFO] Final Memory: 17M/282M
[INFO] ------------------------------------------------------------------------
[ERROR] Failed to execute goal on project org.apache.sling.junit.teleporter: Could not resolve
dependencies for project org.apache.sling:org.apache.sling.junit.teleporter:jar:1.0.9-SNAPSHOT:
The following artifacts could not be resolved: org.apache.sling:org.apache.sling.junit.core:jar:1.0.23,
org.apache.sling:org.apache.sling.testing.clients:jar:1.0.1: Could not find artifact org.apache.sling:org.apache.sling.junit.core:jar:1.0.23
in central (https://repo.maven.apache.org/maven2) -> [Help 1]
[ERROR] 
[ERROR] To see the full stack trace of the errors, re-run Maven with the -e switch.
[ERROR] Re-run Maven using the -X switch to enable full debug logging.
[ERROR] 
[ERROR] For more information about the errors and possible solutions, please read the following
articles:
[ERROR] [Help 1] http://cwiki.apache.org/confluence/display/MAVEN/DependencyResolutionException
channel stopped
Recording test results
ERROR: Step ‘Publish JUnit test result report’ failed: Test reports were found but none
of them are new. Did tests run? 
For example, <https://builds.apache.org/job/sling-testing-junit-teleporter-1.8/ws/target/surefire-reports/TEST-org.apache.sling.testing.teleporter.client.ClassResourceVisitorTest.xml>
is 28 min old



Mime
View raw message