sling-commits mailing list archives

Site index · List index
Message view « Date » · « Thread »
Top « Date » · « Thread »
From Apache Jenkins Server <jenk...@builds.apache.org>
Subject Build failed in Jenkins: sling-testing-junit-teleporter-1.7 #4
Date Fri, 06 Jan 2017 10:35:24 GMT
See <https://builds.apache.org/job/sling-testing-junit-teleporter-1.7/4/changes>

Changes:

[dulvac] [maven-release-plugin] prepare for next development iteration

[dulvac] [maven-release-plugin] prepare release org.apache.sling.junit.teleporter-1.0.10

[dulvac] tmp: non-snapshot dep for release

------------------------------------------
Started by an SCM change
[EnvInject] - Loading node environment variables.
Building remotely on ubuntu-4 (ubuntu) in workspace <https://builds.apache.org/job/sling-testing-junit-teleporter-1.7/ws/>
Updating https://svn.apache.org/repos/asf/sling/trunk/testing/junit/teleporter at revision
'2017-01-06T10:34:34.455 +0000'
U         pom.xml
At revision 1777582

Parsing POMs
Modules changed, recalculating dependency graph
Established TCP socket on 41418
maven32-agent.jar already up to date
maven32-interceptor.jar already up to date
maven3-interceptor-commons.jar already up to date
[sling-testing-junit-teleporter-1.7] $ /home/jenkins/tools/java/latest1.7/bin/java -Xmx2g
-Xms256m -XX:MaxPermSize=512m -cp /home/jenkins/jenkins-slave/maven32-agent.jar:/home/jenkins/tools/maven/apache-maven-3.3.9/boot/plexus-classworlds-2.5.2.jar:/home/jenkins/tools/maven/apache-maven-3.3.9/conf/logging
jenkins.maven3.agent.Maven32Main /home/jenkins/tools/maven/apache-maven-3.3.9 /home/jenkins/jenkins-slave/slave.jar
/home/jenkins/jenkins-slave/maven32-interceptor.jar /home/jenkins/jenkins-slave/maven3-interceptor-commons.jar
41418
<===[JENKINS REMOTING CAPACITY]===>   channel started
Executing Maven:  -B -f <https://builds.apache.org/job/sling-testing-junit-teleporter-1.7/ws/pom.xml>
-Dmaven.repo.local=/home/jenkins/jenkins-slave/maven-repositories/1 -U clean deploy
[INFO] Scanning for projects...
[INFO]                                                                         
[INFO] ------------------------------------------------------------------------
[INFO] Building Apache Sling JUnit Tests Teleporter 1.0.11-SNAPSHOT
[INFO] ------------------------------------------------------------------------
[INFO] Downloading: https://repo.maven.apache.org/maven2/org/apache/sling/org.apache.sling.junit.core/1.0.23/org.apache.sling.junit.core-1.0.23.pom
[WARNING] The POM for org.apache.sling:org.apache.sling.junit.core:jar:1.0.23 is missing,
no dependency information available
[INFO] Downloading: https://repo.maven.apache.org/maven2/org/apache/sling/org.apache.sling.testing.clients/1.0.1/org.apache.sling.testing.clients-1.0.1.pom
[WARNING] The POM for org.apache.sling:org.apache.sling.testing.clients:jar:1.0.1 is missing,
no dependency information available
[INFO] Downloading: https://repo.maven.apache.org/maven2/org/apache/sling/org.apache.sling.junit.core/1.0.23/org.apache.sling.junit.core-1.0.23.jar
[INFO] Downloading: https://repo.maven.apache.org/maven2/org/apache/sling/org.apache.sling.testing.clients/1.0.1/org.apache.sling.testing.clients-1.0.1.jar
[JENKINS] Archiving disabled
[JENKINS] Archiving disabled[INFO] ------------------------------------------------------------------------
[INFO] BUILD FAILURE
[INFO] ------------------------------------------------------------------------
[INFO] Total time: 3.203 s
[INFO] Finished at: 2017-01-06T10:35:05+00:00

[INFO] Final Memory: 15M/310M
[INFO] ------------------------------------------------------------------------
[ERROR] Failed to execute goal on project org.apache.sling.junit.teleporter: Could not resolve
dependencies for project org.apache.sling:org.apache.sling.junit.teleporter:jar:1.0.11-SNAPSHOT:
The following artifacts could not be resolved: org.apache.sling:org.apache.sling.junit.core:jar:1.0.23,
org.apache.sling:org.apache.sling.testing.clients:jar:1.0.1: Could not find artifact org.apache.sling:org.apache.sling.junit.core:jar:1.0.23
in central (https://repo.maven.apache.org/maven2) -> [Help 1]
[ERROR] 
[ERROR] To see the full stack trace of the errors, re-run Maven with the -e switch.
[ERROR] Re-run Maven using the -X switch to enable full debug logging.
[ERROR] 
[ERROR] For more information about the errors and possible solutions, please read the following
articles:
[ERROR] [Help 1] http://cwiki.apache.org/confluence/display/MAVEN/DependencyResolutionException
channel stopped
Recording test results
ERROR: Step ?Publish JUnit test result report? failed: Test reports were found but none of
them are new. Did tests run? 
For example, <https://builds.apache.org/job/sling-testing-junit-teleporter-1.7/ws/target/surefire-reports/TEST-org.apache.sling.testing.teleporter.client.ClassResourceVisitorTest.xml>
is 6 min 6 sec old



Mime
View raw message