sling-commits mailing list archives

Site index · List index
Message view « Date » · « Thread »
Top « Date » · « Thread »
From Apache Jenkins Server <jenk...@builds.apache.org>
Subject Build failed in Jenkins: sling-bundles-scripting-sightly-engine-1.7 #36
Date Thu, 15 Dec 2016 14:16:00 GMT
See <https://builds.apache.org/job/sling-bundles-scripting-sightly-engine-1.7/36/changes>

Changes:

[radu] [maven-release-plugin] prepare for next development iteration

[radu] [maven-release-plugin] prepare release org.apache.sling.scripting.sightly-1.0.28

[radu] releng: updated compiler dependencies

------------------------------------------
Started by an SCM change
[EnvInject] - Loading node environment variables.
Building remotely on H13 (ubuntu) in workspace <https://builds.apache.org/job/sling-bundles-scripting-sightly-engine-1.7/ws/>
Updating https://svn.apache.org/repos/asf/sling/trunk/bundles/scripting/sightly/engine at
revision '2016-12-15T14:15:08.506 +0000'
U         pom.xml
At revision 1774461

WARNING: clock of the subversion server appears to be out of sync. This can result in inconsistent
check out behavior.
Parsing POMs
Modules changed, recalculating dependency graph
Established TCP socket on 34430
maven32-agent.jar already up to date
maven32-interceptor.jar already up to date
maven3-interceptor-commons.jar already up to date
[sling-bundles-scripting-sightly-engine-1.7] $ /home/jenkins/tools/java/latest1.7/bin/java
-Xmx2g -Xms256m -XX:MaxPermSize=512m -cp /home/jenkins/jenkins-slave/maven32-agent.jar:/home/jenkins/tools/maven/apache-maven-3.3.9/boot/plexus-classworlds-2.5.2.jar:/home/jenkins/tools/maven/apache-maven-3.3.9/conf/logging
jenkins.maven3.agent.Maven32Main /home/jenkins/tools/maven/apache-maven-3.3.9 /home/jenkins/jenkins-slave/slave.jar
/home/jenkins/jenkins-slave/maven32-interceptor.jar /home/jenkins/jenkins-slave/maven3-interceptor-commons.jar
34430
<===[JENKINS REMOTING CAPACITY]===>   channel started
Executing Maven:  -B -f <https://builds.apache.org/job/sling-bundles-scripting-sightly-engine-1.7/ws/pom.xml>
-Dmaven.repo.local=/home/jenkins/jenkins-slave/maven-repositories/0 -U clean deploy
[INFO] Scanning for projects...
[INFO]                                                                         
[INFO] ------------------------------------------------------------------------
[INFO] Building Apache Sling Scripting HTL Engine 1.0.29-SNAPSHOT
[INFO] ------------------------------------------------------------------------
[INFO] Downloading: https://repo.maven.apache.org/maven2/org/apache/sling/org.apache.sling.scripting.sightly.compiler/1.0.4/org.apache.sling.scripting.sightly.compiler-1.0.4.pom
[WARNING] The POM for org.apache.sling:org.apache.sling.scripting.sightly.compiler:jar:1.0.4
is missing, no dependency information available
[INFO] Downloading: https://repo.maven.apache.org/maven2/org/apache/sling/org.apache.sling.scripting.sightly.compiler.java/1.0.6/org.apache.sling.scripting.sightly.compiler.java-1.0.6.pom
[WARNING] The POM for org.apache.sling:org.apache.sling.scripting.sightly.compiler.java:jar:1.0.6
is missing, no dependency information available
[INFO] Downloading: https://repo.maven.apache.org/maven2/org/apache/sling/org.apache.sling.scripting.api/2.1.12/org.apache.sling.scripting.api-2.1.12.pom
[INFO] Downloaded: https://repo.maven.apache.org/maven2/org/apache/sling/org.apache.sling.scripting.api/2.1.12/org.apache.sling.scripting.api-2.1.12.pom
(3 KB at 11.7 KB/sec)
[INFO] Downloading: https://repo.maven.apache.org/maven2/org/apache/sling/org.apache.sling.scripting.sightly.compiler/1.0.4/org.apache.sling.scripting.sightly.compiler-1.0.4.jar
[INFO] Downloading: https://repo.maven.apache.org/maven2/org/apache/sling/org.apache.sling.scripting.sightly.compiler.java/1.0.6/org.apache.sling.scripting.sightly.compiler.java-1.0.6.jar
[INFO] Downloading: https://repo.maven.apache.org/maven2/org/apache/sling/org.apache.sling.scripting.api/2.1.12/org.apache.sling.scripting.api-2.1.12.jar
[INFO] Downloaded: https://repo.maven.apache.org/maven2/org/apache/sling/org.apache.sling.scripting.api/2.1.12/org.apache.sling.scripting.api-2.1.12.jar
(17 KB at 81.1 KB/sec)
[JENKINS] Archiving disabled
[JENKINS] Archiving disabled[INFO] ------------------------------------------------------------------------
[INFO] BUILD FAILURE
[INFO] ------------------------------------------------------------------------
[INFO] Total time: 4.526 s
[INFO] Finished at: 2016-12-15T13:46:17+00:00

[INFO] Final Memory: 19M/310M
[INFO] ------------------------------------------------------------------------
[ERROR] Failed to execute goal on project org.apache.sling.scripting.sightly: Could not resolve
dependencies for project org.apache.sling:org.apache.sling.scripting.sightly:bundle:1.0.29-SNAPSHOT:
The following artifacts could not be resolved: org.apache.sling:org.apache.sling.scripting.sightly.compiler:jar:1.0.4,
org.apache.sling:org.apache.sling.scripting.sightly.compiler.java:jar:1.0.6: Could not find
artifact org.apache.sling:org.apache.sling.scripting.sightly.compiler:jar:1.0.4 in central
(https://repo.maven.apache.org/maven2) -> [Help 1]
[ERROR] 
[ERROR] To see the full stack trace of the errors, re-run Maven with the -e switch.
[ERROR] Re-run Maven using the -X switch to enable full debug logging.
[ERROR] 
[ERROR] For more information about the errors and possible solutions, please read the following
articles:
[ERROR] [Help 1] http://cwiki.apache.org/confluence/display/MAVEN/DependencyResolutionException
channel stopped
Recording test results
ERROR: Step ?Publish JUnit test result report? failed: Test reports were found but none of
them are new. Did tests run? 
For example, <https://builds.apache.org/job/sling-bundles-scripting-sightly-engine-1.7/ws/target/surefire-reports/TEST-org.apache.sling.scripting.sightly.impl.compiler.SightlyJavaCompilerServiceTest.xml>
is 10 min old



Mime
View raw message