sling-commits mailing list archives

Site index · List index
Message view « Date » · « Thread »
Top « Date » · « Thread »
From Apache Jenkins Server <jenk...@builds.apache.org>
Subject Build failed in Jenkins: sling-contrib-extensions-contextaware-config-integration-tests-1.8 #281
Date Tue, 13 Dec 2016 13:29:50 GMT
See <https://builds.apache.org/job/sling-contrib-extensions-contextaware-config-integration-tests-1.8/281/>

------------------------------------------
Started by upstream project "sling-launchpad-builder-1.8" build number 368
originally caused by:
 Started by upstream project "sling-bundles-scripting-jsp-1.7" build number 10
 originally caused by:
  Started by an SCM change
[EnvInject] - Loading node environment variables.
Building remotely on H15 (ubuntu) in workspace <https://builds.apache.org/job/sling-contrib-extensions-contextaware-config-integration-tests-1.8/ws/>
Updating https://svn.apache.org/repos/asf/sling/trunk/contrib/extensions/contextaware-config/integration-tests
at revision '2016-12-13T13:09:27.062 +0000'
At revision 1774006

No changes for https://svn.apache.org/repos/asf/sling/trunk/contrib/extensions/contextaware-config/integration-tests
since the previous build
Parsing POMs
Modules changed, recalculating dependency graph
Established TCP socket on 43215
maven32-agent.jar already up to date
maven32-interceptor.jar already up to date
maven3-interceptor-commons.jar already up to date
[sling-contrib-extensions-contextaware-config-integration-tests-1.8] $ /home/jenkins/tools/java/latest1.8/bin/java
-Xmx2g -Xms256m -XX:MaxPermSize=512m -cp /home/jenkins/jenkins-slave/maven32-agent.jar:/home/jenkins/tools/maven/apache-maven-3.3.9/boot/plexus-classworlds-2.5.2.jar:/home/jenkins/tools/maven/apache-maven-3.3.9/conf/logging
jenkins.maven3.agent.Maven32Main /home/jenkins/tools/maven/apache-maven-3.3.9 /home/jenkins/jenkins-slave/slave.jar
/home/jenkins/jenkins-slave/maven32-interceptor.jar /home/jenkins/jenkins-slave/maven3-interceptor-commons.jar
43215
Java HotSpot(TM) 64-Bit Server VM warning: ignoring option MaxPermSize=512m; support was removed
in 8.0
<===[JENKINS REMOTING CAPACITY]===>   channel started
Executing Maven:  -B -f <https://builds.apache.org/job/sling-contrib-extensions-contextaware-config-integration-tests-1.8/ws/pom.xml>
-Dmaven.repo.local=/home/jenkins/jenkins-slave/maven-repositories/1 -U clean deploy
[INFO] Scanning for projects...
[INFO] Downloading: http://repository.apache.org/snapshots/org/apache/sling/org.apache.sling.launchpad/9-SNAPSHOT/maven-metadata.xml
[INFO] Downloaded: http://repository.apache.org/snapshots/org/apache/sling/org.apache.sling.launchpad/9-SNAPSHOT/maven-metadata.xml
(2 KB at 3.1 KB/sec)
[INFO] Downloading: http://repository.apache.org/snapshots/org/apache/sling/org.apache.sling.launchpad/9-SNAPSHOT/org.apache.sling.launchpad-9-20161213.130752-1912-slingfeature.txt
[INFO] Downloaded: http://repository.apache.org/snapshots/org/apache/sling/org.apache.sling.launchpad/9-SNAPSHOT/org.apache.sling.launchpad-9-20161213.130752-1912-slingfeature.txt
(16 KB at 43.2 KB/sec)
[INFO]                                                                         
[INFO] ------------------------------------------------------------------------
[INFO] Building Apache Sling Context-Aware Configuration Integration Tests 1-SNAPSHOT
[INFO] ------------------------------------------------------------------------
[INFO] Downloading: http://repository.apache.org/snapshots/org/apache/sling/org.apache.sling.caconfig.api/1.1.1-SNAPSHOT/maven-metadata.xml
[INFO] Downloading: http://repository.apache.org/snapshots/org/apache/sling/org.apache.sling.caconfig.api/1.1.1-SNAPSHOT/org.apache.sling.caconfig.api-1.1.1-SNAPSHOT.pom
[WARNING] The POM for org.apache.sling:org.apache.sling.caconfig.api:jar:1.1.1-SNAPSHOT is
missing, no dependency information available
[INFO] Downloading: http://repository.apache.org/snapshots/org/apache/sling/org.apache.sling.caconfig.spi/1.2.1-SNAPSHOT/maven-metadata.xml
[INFO] Downloading: http://repository.apache.org/snapshots/org/apache/sling/org.apache.sling.caconfig.spi/1.2.1-SNAPSHOT/org.apache.sling.caconfig.spi-1.2.1-SNAPSHOT.pom
[WARNING] The POM for org.apache.sling:org.apache.sling.caconfig.spi:jar:1.2.1-SNAPSHOT is
missing, no dependency information available
[INFO] Downloading: http://repository.apache.org/snapshots/org/apache/sling/org.apache.sling.caconfig.impl/1.2.1-SNAPSHOT/maven-metadata.xml
[INFO] Downloading: http://repository.apache.org/snapshots/org/apache/sling/org.apache.sling.caconfig.impl/1.2.1-SNAPSHOT/org.apache.sling.caconfig.impl-1.2.1-SNAPSHOT.pom
[WARNING] The POM for org.apache.sling:org.apache.sling.caconfig.impl:jar:1.2.1-SNAPSHOT is
missing, no dependency information available
[INFO] Downloading: http://repository.apache.org/snapshots/org/apache/sling/org.apache.sling.junit.core/1.0.19-SNAPSHOT/maven-metadata.xml
[INFO] Downloaded: http://repository.apache.org/snapshots/org/apache/sling/org.apache.sling.junit.core/1.0.19-SNAPSHOT/maven-metadata.xml
(1011 B at 2.7 KB/sec)
[INFO] Downloading: http://repository.apache.org/snapshots/org/apache/sling/org.apache.sling.launchpad/9-SNAPSHOT/org.apache.sling.launchpad-9-20161213.130752-1912.pom
[INFO] Downloaded: http://repository.apache.org/snapshots/org/apache/sling/org.apache.sling.launchpad/9-SNAPSHOT/org.apache.sling.launchpad-9-20161213.130752-1912.pom
(8 KB at 19.8 KB/sec)
[INFO] Downloading: http://repository.apache.org/snapshots/org/apache/sling/org.apache.sling.commons.log/5.0.1-SNAPSHOT/maven-metadata.xml
[INFO] Downloaded: http://repository.apache.org/snapshots/org/apache/sling/org.apache.sling.commons.log/5.0.1-SNAPSHOT/maven-metadata.xml
(1008 B at 2.7 KB/sec)
[INFO] Downloading: http://repository.apache.org/snapshots/org/apache/sling/org.apache.sling.installer.core/3.8.1-SNAPSHOT/maven-metadata.xml
[INFO] Downloaded: http://repository.apache.org/snapshots/org/apache/sling/org.apache.sling.installer.core/3.8.1-SNAPSHOT/maven-metadata.xml
(1011 B at 2.8 KB/sec)
[INFO] Downloading: http://repository.apache.org/snapshots/org/apache/sling/org.apache.sling.jcr.oak.server/1.1.3-SNAPSHOT/maven-metadata.xml
[INFO] Downloaded: http://repository.apache.org/snapshots/org/apache/sling/org.apache.sling.jcr.oak.server/1.1.3-SNAPSHOT/maven-metadata.xml
(1015 B at 2.8 KB/sec)
[INFO] Downloading: http://repository.apache.org/snapshots/org/apache/sling/org.apache.sling.provisioning.model/1.7.1-SNAPSHOT/maven-metadata.xml
[INFO] Downloaded: http://repository.apache.org/snapshots/org/apache/sling/org.apache.sling.provisioning.model/1.7.1-SNAPSHOT/maven-metadata.xml
(1015 B at 2.7 KB/sec)
[INFO] Downloading: http://repository.apache.org/snapshots/org/apache/sling/org.apache.sling.commons.fsclassloader/1.0.3-SNAPSHOT/maven-metadata.xml
[INFO] Downloaded: http://repository.apache.org/snapshots/org/apache/sling/org.apache.sling.commons.fsclassloader/1.0.3-SNAPSHOT/maven-metadata.xml
(2 KB at 2.8 KB/sec)
[INFO] Downloading: http://repository.apache.org/snapshots/org/apache/sling/org.apache.sling.fsresource/1.1.5-SNAPSHOT/maven-metadata.xml
[INFO] Downloaded: http://repository.apache.org/snapshots/org/apache/sling/org.apache.sling.fsresource/1.1.5-SNAPSHOT/maven-metadata.xml
(1019 B at 2.8 KB/sec)
[INFO] Downloading: http://repository.apache.org/snapshots/org/apache/sling/org.apache.sling.installer.console/1.0.1-SNAPSHOT/maven-metadata.xml
[INFO] Downloaded: http://repository.apache.org/snapshots/org/apache/sling/org.apache.sling.installer.console/1.0.1-SNAPSHOT/maven-metadata.xml
(2 KB at 2.8 KB/sec)
[INFO] Downloading: http://repository.apache.org/snapshots/org/apache/sling/org.apache.sling.installer.provider.jcr/3.1.23-SNAPSHOT/maven-metadata.xml
[INFO] Downloaded: http://repository.apache.org/snapshots/org/apache/sling/org.apache.sling.installer.provider.jcr/3.1.23-SNAPSHOT/maven-metadata.xml
(1023 B at 2.8 KB/sec)
[INFO] Downloading: http://repository.apache.org/snapshots/org/apache/sling/org.apache.sling.jcr.contentloader/2.1.11-SNAPSHOT/maven-metadata.xml
[INFO] Downloaded: http://repository.apache.org/snapshots/org/apache/sling/org.apache.sling.jcr.contentloader/2.1.11-SNAPSHOT/maven-metadata.xml
(2 KB at 2.8 KB/sec)
[INFO] Downloading: http://repository.apache.org/snapshots/org/apache/sling/org.apache.sling.launchpad.content/2.0.9-SNAPSHOT/maven-metadata.xml
[INFO] Downloaded: http://repository.apache.org/snapshots/org/apache/sling/org.apache.sling.launchpad.content/2.0.9-SNAPSHOT/maven-metadata.xml
(2 KB at 2.8 KB/sec)
[INFO] Downloading: http://repository.apache.org/snapshots/org/apache/sling/org.apache.sling.resourceresolver/1.5.7-SNAPSHOT/maven-metadata.xml
[INFO] Downloaded: http://repository.apache.org/snapshots/org/apache/sling/org.apache.sling.resourceresolver/1.5.7-SNAPSHOT/maven-metadata.xml
(1017 B at 2.8 KB/sec)
[INFO] Downloading: http://repository.apache.org/snapshots/org/apache/sling/org.apache.sling.commons.metrics/1.0.1-SNAPSHOT/maven-metadata.xml
[INFO] Downloaded: http://repository.apache.org/snapshots/org/apache/sling/org.apache.sling.commons.metrics/1.0.1-SNAPSHOT/maven-metadata.xml
(1 KB at 2.7 KB/sec)
[INFO] Downloading: http://repository.apache.org/snapshots/org/apache/sling/org.apache.sling.jcr.base/2.4.3-SNAPSHOT/maven-metadata.xml
[INFO] Downloaded: http://repository.apache.org/snapshots/org/apache/sling/org.apache.sling.jcr.base/2.4.3-SNAPSHOT/maven-metadata.xml
(1009 B at 2.7 KB/sec)
[INFO] Downloading: http://repository.apache.org/snapshots/org/apache/sling/org.apache.sling.jcr.webdav/2.3.5-SNAPSHOT/maven-metadata.xml
[INFO] Downloaded: http://repository.apache.org/snapshots/org/apache/sling/org.apache.sling.jcr.webdav/2.3.5-SNAPSHOT/maven-metadata.xml
(1015 B at 2.8 KB/sec)
[INFO] Downloading: http://repository.apache.org/snapshots/org/apache/sling/org.apache.sling.caconfig.api/1.1.1-SNAPSHOT/org.apache.sling.caconfig.api-1.1.1-SNAPSHOT.jar
[INFO] Downloading: http://repository.apache.org/snapshots/org/apache/sling/org.apache.sling.caconfig.spi/1.2.1-SNAPSHOT/org.apache.sling.caconfig.spi-1.2.1-SNAPSHOT.jar
[INFO] Downloading: http://repository.apache.org/snapshots/org/apache/sling/org.apache.sling.caconfig.impl/1.2.1-SNAPSHOT/org.apache.sling.caconfig.impl-1.2.1-SNAPSHOT.jar
[JENKINS] Archiving disabled
[JENKINS] Archiving disabled
[INFO] ------------------------------------------------------------------------
[INFO] BUILD FAILURE
[INFO] ------------------------------------------------------------------------
[INFO] Total time: 20.834 s
[INFO] Finished at: 2016-12-13T13:58:44+00:00
[INFO] Final Memory: 27M/397M
[INFO] ------------------------------------------------------------------------
Waiting for Jenkins to finish collecting data
[ERROR] Failed to execute goal on project org.apache.sling.caconfig.integration-tests: Could
not resolve dependencies for project org.apache.sling:org.apache.sling.caconfig.integration-tests:slingstart:1-SNAPSHOT:
The following artifacts could not be resolved: org.apache.sling:org.apache.sling.caconfig.api:jar:1.1.1-SNAPSHOT,
org.apache.sling:org.apache.sling.caconfig.spi:jar:1.2.1-SNAPSHOT, org.apache.sling:org.apache.sling.caconfig.impl:jar:1.2.1-SNAPSHOT:
Could not find artifact org.apache.sling:org.apache.sling.caconfig.api:jar:1.1.1-SNAPSHOT
in Nexus (http://repository.apache.org/snapshots) -> [Help 1]
[ERROR] 
[ERROR] To see the full stack trace of the errors, re-run Maven with the -e switch.
[ERROR] Re-run Maven using the -X switch to enable full debug logging.
[ERROR] 
[ERROR] For more information about the errors and possible solutions, please read the following
articles:
[ERROR] [Help 1] http://cwiki.apache.org/confluence/display/MAVEN/DependencyResolutionException
channel stopped
Recording test results
ERROR: Step ?Publish JUnit test result report? failed: Test reports were found but none of
them are new. Did tests run? 
For example, <https://builds.apache.org/job/sling-contrib-extensions-contextaware-config-integration-tests-1.8/ws/target/failsafe-reports/TEST-org.apache.sling.caconfig.it.AdaptToConfigClassIT.xml>
is 17 hr old



Mime
View raw message