sling-commits mailing list archives

Site index · List index
Message view « Date » · « Thread »
Top « Date » · « Thread »
From Apache Jenkins Server <jenk...@builds.apache.org>
Subject Build failed in Jenkins: sling-bundles-extensions-models-integration-tests-1.7 #26
Date Mon, 19 Dec 2016 10:05:20 GMT
See <https://builds.apache.org/job/sling-bundles-extensions-models-integration-tests-1.7/26/>

------------------------------------------
Started by upstream project "sling-bundles-extensions-models-impl-1.7" build number 28
originally caused by:
 Started by an SCM change
[EnvInject] - Loading node environment variables.
Building remotely on ubuntu-6 (ubuntu) in workspace <https://builds.apache.org/job/sling-bundles-extensions-models-integration-tests-1.7/ws/>
Updating https://svn.apache.org/repos/asf/sling/trunk/bundles/extensions/models/integration-tests
at revision '2016-12-19T10:03:48.057 +0000'
At revision 1775039

WARNING: clock of the subversion server appears to be out of sync. This can result in inconsistent
check out behavior.
No changes for https://svn.apache.org/repos/asf/sling/trunk/bundles/extensions/models/integration-tests
since the previous build
Parsing POMs
Established TCP socket on 57450
maven32-agent.jar already up to date
maven32-interceptor.jar already up to date
maven3-interceptor-commons.jar already up to date
[sling-bundles-extensions-models-integration-tests-1.7] $ /home/jenkins/tools/java/latest1.7/bin/java
-Xmx2g -Xms256m -XX:MaxPermSize=512m -cp /home/jenkins/jenkins-slave/maven32-agent.jar:/home/jenkins/tools/maven/apache-maven-3.3.9/boot/plexus-classworlds-2.5.2.jar:/home/jenkins/tools/maven/apache-maven-3.3.9/conf/logging
jenkins.maven3.agent.Maven32Main /home/jenkins/tools/maven/apache-maven-3.3.9 /home/jenkins/jenkins-slave/slave.jar
/home/jenkins/jenkins-slave/maven32-interceptor.jar /home/jenkins/jenkins-slave/maven3-interceptor-commons.jar
57450
<===[JENKINS REMOTING CAPACITY]===>   channel started
Executing Maven:  -B -f <https://builds.apache.org/job/sling-bundles-extensions-models-integration-tests-1.7/ws/pom.xml>
-Dmaven.repo.local=/home/jenkins/jenkins-slave/maven-repositories/0 -U clean deploy
[INFO] Scanning for projects...
[INFO]                                                                         
[INFO] ------------------------------------------------------------------------
[INFO] Building Apache Sling Models Integration Tests 0.0.1-SNAPSHOT
[INFO] ------------------------------------------------------------------------
[INFO] Downloading: http://repository.apache.org/snapshots/org/apache/sling/org.apache.sling.models.api/1.3.3-SNAPSHOT/maven-metadata.xml
[INFO] Downloaded: http://repository.apache.org/snapshots/org/apache/sling/org.apache.sling.models.api/1.3.3-SNAPSHOT/maven-metadata.xml
(1007 B at 2.0 KB/sec)
[INFO] Downloading: http://repository.apache.org/snapshots/org/apache/sling/org.apache.sling.models.impl/1.3.7-SNAPSHOT/maven-metadata.xml
[INFO] Downloaded: http://repository.apache.org/snapshots/org/apache/sling/org.apache.sling.models.impl/1.3.7-SNAPSHOT/maven-metadata.xml
(1012 B at 2.8 KB/sec)
[INFO] Downloading: http://repository.apache.org/snapshots/org/apache/sling/org.apache.sling.models.jacksonexporter/1.0.7-SNAPSHOT/maven-metadata.xml
[INFO] Downloaded: http://repository.apache.org/snapshots/org/apache/sling/org.apache.sling.models.jacksonexporter/1.0.7-SNAPSHOT/maven-metadata.xml
(1019 B at 2.7 KB/sec)
[INFO] 
[INFO] --- maven-clean-plugin:2.5:clean (default-clean) @ org.apache.sling.models.integration-tests
---
[INFO] Deleting <https://builds.apache.org/job/sling-bundles-extensions-models-integration-tests-1.7/ws/target>
[INFO] Deleting <https://builds.apache.org/job/sling-bundles-extensions-models-integration-tests-1.7/ws/>
(includes = [sling/**], excludes = [])
[INFO] 
[INFO] --- maven-enforcer-plugin:1.3.1:enforce (enforce-java) @ org.apache.sling.models.integration-tests
---
[INFO] 
[INFO] --- maven-antrun-plugin:1.8:run (set-bundle-required-execution-environment) @ org.apache.sling.models.integration-tests
---
[INFO] Executing tasks

main:
Setting Bundle-RequiredExecutionEnvironment=JavaSE-1.7 from sling.java.version=7
[INFO] Executed tasks
[INFO] 
[INFO] --- maven-remote-resources-plugin:1.5:process (default) @ org.apache.sling.models.integration-tests
---
[INFO] 
[INFO] --- maven-resources-plugin:2.7:resources (default-resources) @ org.apache.sling.models.integration-tests
---
[INFO] Using 'UTF-8' encoding to copy filtered resources.
[INFO] Copying 1 resource
[INFO] Copying 3 resources
[INFO] 
[INFO] --- maven-antrun-plugin:1.8:run (check-memory-task) @ org.apache.sling.models.integration-tests
---
[INFO] Executing tasks

main:
     [echo] **************** WARNING (SLING-443/SLING-1782) ******************************
     [echo] On most platforms, you'll get OutOfMemoryErrors when building unless you set
     [echo] on 32bit platforms: MAVEN_OPTS="-Xmx256M -XX:MaxPermSize=256M", see SLING-443
     [echo] on 64bit platforms: MAVEN_OPTS="-Xmx512M -XX:MaxPermSize=512M", see SLING-1782
     [echo] ******************************************************************************
[INFO] Executed tasks
[INFO] 
[INFO] --- maven-dependency-plugin:2.10:copy-dependencies (copy-runnable-jar) @ org.apache.sling.models.integration-tests
---
[INFO] Copying org.apache.sling.launchpad-7-standalone.jar to <https://builds.apache.org/job/sling-bundles-extensions-models-integration-tests-1.7/ws/target/dependency/org.apache.sling.launchpad-7-standalone.jar>
[INFO] 
[INFO] --- maven-dependency-plugin:2.10:copy-dependencies (copy-additional-bundles) @ org.apache.sling.models.integration-tests
---
[INFO] Copying org.osgi.core-4.1.0.jar to <https://builds.apache.org/job/sling-bundles-extensions-models-integration-tests-1.7/ws/target/sling/additional-bundles/org.osgi.core-4.1.0.jar>
[INFO] Copying commons-io-1.4.jar to <https://builds.apache.org/job/sling-bundles-extensions-models-integration-tests-1.7/ws/target/sling/additional-bundles/commons-io-1.4.jar>
[INFO] Copying org.apache.sling.engine-2.2.0.jar to <https://builds.apache.org/job/sling-bundles-extensions-models-integration-tests-1.7/ws/target/sling/additional-bundles/org.apache.sling.engine-2.2.0.jar>
[INFO] Copying geronimo-atinject_1.0_spec-1.0.jar to <https://builds.apache.org/job/sling-bundles-extensions-models-integration-tests-1.7/ws/target/sling/additional-bundles/geronimo-atinject_1.0_spec-1.0.jar>
[INFO] Copying org.apache.sling.testing.tools-1.0.12.jar to <https://builds.apache.org/job/sling-bundles-extensions-models-integration-tests-1.7/ws/target/sling/additional-bundles/org.apache.sling.testing.tools-1.0.12.jar>
[INFO] Copying jackson-annotations-2.3.2.jar to <https://builds.apache.org/job/sling-bundles-extensions-models-integration-tests-1.7/ws/target/sling/additional-bundles/jackson-annotations-2.3.2.jar>
[INFO] Copying slf4j-simple-1.5.2.jar to <https://builds.apache.org/job/sling-bundles-extensions-models-integration-tests-1.7/ws/target/sling/additional-bundles/slf4j-simple-1.5.2.jar>
[INFO] Copying org.apache.sling.models.jacksonexporter-1.0.7-SNAPSHOT.jar to <https://builds.apache.org/job/sling-bundles-extensions-models-integration-tests-1.7/ws/target/sling/additional-bundles/org.apache.sling.models.jacksonexporter-1.0.7-SNAPSHOT.jar>
[INFO] Copying bndlib-1.50.0.jar to <https://builds.apache.org/job/sling-bundles-extensions-models-integration-tests-1.7/ws/target/sling/additional-bundles/bndlib-1.50.0.jar>
[INFO] Copying httpcore-osgi-4.1.2.jar to <https://builds.apache.org/job/sling-bundles-extensions-models-integration-tests-1.7/ws/target/sling/additional-bundles/httpcore-osgi-4.1.2.jar>
[INFO] Copying org.apache.felix.scr.annotations-1.9.12.jar to <https://builds.apache.org/job/sling-bundles-extensions-models-integration-tests-1.7/ws/target/sling/additional-bundles/org.apache.felix.scr.annotations-1.9.12.jar>
[INFO] Copying org.apache.sling.junit.remote-1.0.8.jar to <https://builds.apache.org/job/sling-bundles-extensions-models-integration-tests-1.7/ws/target/sling/additional-bundles/org.apache.sling.junit.remote-1.0.8.jar>
[INFO] Copying jackson-databind-2.3.2.jar to <https://builds.apache.org/job/sling-bundles-extensions-models-integration-tests-1.7/ws/target/sling/additional-bundles/jackson-databind-2.3.2.jar>
[INFO] Copying org.apache.sling.junit.core-1.0.8.jar to <https://builds.apache.org/job/sling-bundles-extensions-models-integration-tests-1.7/ws/target/sling/additional-bundles/org.apache.sling.junit.core-1.0.8.jar>
[INFO] Copying org.apache.sling.commons.json-2.0.6.jar to <https://builds.apache.org/job/sling-bundles-extensions-models-integration-tests-1.7/ws/target/sling/additional-bundles/org.apache.sling.commons.json-2.0.6.jar>
[INFO] Copying jcr-1.0.jar to <https://builds.apache.org/job/sling-bundles-extensions-models-integration-tests-1.7/ws/target/sling/additional-bundles/jcr-1.0.jar>
[INFO] Copying org.apache.sling.models.api-1.3.3-SNAPSHOT.jar to <https://builds.apache.org/job/sling-bundles-extensions-models-integration-tests-1.7/ws/target/sling/additional-bundles/org.apache.sling.models.api-1.3.3-SNAPSHOT.jar>
[INFO] Copying org.apache.sling.api-2.4.0.jar to <https://builds.apache.org/job/sling-bundles-extensions-models-integration-tests-1.7/ws/target/sling/additional-bundles/org.apache.sling.api-2.4.0.jar>
[INFO] Copying commons-lang-2.5.jar to <https://builds.apache.org/job/sling-bundles-extensions-models-integration-tests-1.7/ws/target/sling/additional-bundles/commons-lang-2.5.jar>
[INFO] Copying jackson-core-2.3.2.jar to <https://builds.apache.org/job/sling-bundles-extensions-models-integration-tests-1.7/ws/target/sling/additional-bundles/jackson-core-2.3.2.jar>
[INFO] Copying slf4j-api-1.5.2.jar to <https://builds.apache.org/job/sling-bundles-extensions-models-integration-tests-1.7/ws/target/sling/additional-bundles/slf4j-api-1.5.2.jar>
[INFO] Copying httpclient-osgi-4.1.2.jar to <https://builds.apache.org/job/sling-bundles-extensions-models-integration-tests-1.7/ws/target/sling/additional-bundles/httpclient-osgi-4.1.2.jar>
[INFO] Copying org.osgi.compendium-4.1.0.jar to <https://builds.apache.org/job/sling-bundles-extensions-models-integration-tests-1.7/ws/target/sling/additional-bundles/org.osgi.compendium-4.1.0.jar>
[INFO] Copying org.apache.sling.launchpad-7-standalone.jar to <https://builds.apache.org/job/sling-bundles-extensions-models-integration-tests-1.7/ws/target/sling/additional-bundles/org.apache.sling.launchpad-7-standalone.jar>
[INFO] Copying servlet-api-2.4.jar to <https://builds.apache.org/job/sling-bundles-extensions-models-integration-tests-1.7/ws/target/sling/additional-bundles/servlet-api-2.4.jar>
[INFO] Copying junit-4.12.jar to <https://builds.apache.org/job/sling-bundles-extensions-models-integration-tests-1.7/ws/target/sling/additional-bundles/junit-4.12.jar>
[INFO] Copying org.apache.sling.models.impl-1.3.7-SNAPSHOT.jar to <https://builds.apache.org/job/sling-bundles-extensions-models-integration-tests-1.7/ws/target/sling/additional-bundles/org.apache.sling.models.impl-1.3.7-SNAPSHOT.jar>
[INFO] 
[INFO] --- build-helper-maven-plugin:1.9.1:reserve-network-port (reserve-server-port) @ org.apache.sling.models.integration-tests
---
[INFO] Reserved port 55738 for http.port
[INFO] 
[INFO] --- maven-compiler-plugin:3.2:compile (default-compile) @ org.apache.sling.models.integration-tests
---
[INFO] Changes detected - recompiling the module!
[INFO] Compiling 44 source files to <https://builds.apache.org/job/sling-bundles-extensions-models-integration-tests-1.7/ws/target/classes>
[INFO] <https://builds.apache.org/job/sling-bundles-extensions-models-integration-tests-1.7/ws/src/main/java/org/apache/sling/models/it/exporter/FakeResponse.java>:
Some input files use or override a deprecated API.
[INFO] <https://builds.apache.org/job/sling-bundles-extensions-models-integration-tests-1.7/ws/src/main/java/org/apache/sling/models/it/exporter/FakeResponse.java>:
Recompile with -Xlint:deprecation for details.
[INFO] <https://builds.apache.org/job/sling-bundles-extensions-models-integration-tests-1.7/ws/src/main/java/org/apache/sling/models/it/exporter/ExporterTest.java>:
<https://builds.apache.org/job/sling-bundles-extensions-models-integration-tests-1.7/ws/src/main/java/org/apache/sling/models/it/exporter/ExporterTest.java>
uses unchecked or unsafe operations.
[INFO] <https://builds.apache.org/job/sling-bundles-extensions-models-integration-tests-1.7/ws/src/main/java/org/apache/sling/models/it/exporter/ExporterTest.java>:
Recompile with -Xlint:unchecked for details.
[INFO] 
[INFO] --- maven-scr-plugin:1.21.0:scr (generate-scr-scrdescriptor) @ org.apache.sling.models.integration-tests
---
[INFO] Writing 1 Service Component Descriptors to <https://builds.apache.org/job/sling-bundles-extensions-models-integration-tests-1.7/ws/target/classes/OSGI-INF/org.apache.sling.models.it.implpicker.CustomLastImplementationPicker.xml>
[INFO] Writing 1 Service Component Descriptors to <https://builds.apache.org/job/sling-bundles-extensions-models-integration-tests-1.7/ws/target/classes/OSGI-INF/org.apache.sling.models.it.services.TestBindingsValuesProvider.xml>
[INFO] Writing 1 Service Component Descriptors to <https://builds.apache.org/job/sling-bundles-extensions-models-integration-tests-1.7/ws/target/classes/OSGI-INF/org.apache.sling.models.it.services.AnotherTestBindingsValuesProvider.xml>
[INFO] 
[INFO] --- maven-resources-plugin:2.7:testResources (default-testResources) @ org.apache.sling.models.integration-tests
---
[INFO] Using 'UTF-8' encoding to copy filtered resources.
[INFO] skip non existing resourceDirectory <https://builds.apache.org/job/sling-bundles-extensions-models-integration-tests-1.7/ws/src/test/resources>
[INFO] Copying 3 resources
[INFO] 
[INFO] --- maven-compiler-plugin:3.2:testCompile (default-testCompile) @ org.apache.sling.models.integration-tests
---
[INFO] Changes detected - recompiling the module!
[INFO] Compiling 1 source file to <https://builds.apache.org/job/sling-bundles-extensions-models-integration-tests-1.7/ws/target/test-classes>
[INFO] 
[INFO] --- maven-surefire-plugin:2.18.1:test (default-test) @ org.apache.sling.models.integration-tests
---
[JENKINS] Recording test results[INFO] 
[INFO] --- animal-sniffer-maven-plugin:1.14:check (default) @ org.apache.sling.models.integration-tests
---

[INFO] Checking unresolved references to org.codehaus.mojo.signature:java17:1.0
[INFO] 
[INFO] --- maven-bundle-plugin:3.0.1:bundle (default-bundle) @ org.apache.sling.models.integration-tests
---
[INFO] 
[INFO] >>> maven-source-plugin:2.4:jar (attach-sources) > generate-sources @ org.apache.sling.models.integration-tests
>>>
[INFO] 
[INFO] --- maven-enforcer-plugin:1.3.1:enforce (enforce-java) @ org.apache.sling.models.integration-tests
---
[INFO] 
[INFO] --- maven-antrun-plugin:1.8:run (set-bundle-required-execution-environment) @ org.apache.sling.models.integration-tests
---
[INFO] Executing tasks

main:
Setting Bundle-RequiredExecutionEnvironment=JavaSE-1.7 from sling.java.version=7
[INFO] Executed tasks
[WARNING] Failed to getClass for org.apache.maven.plugin.source.SourceJarMojo
[INFO] 
[INFO] <<< maven-source-plugin:2.4:jar (attach-sources) < generate-sources @ org.apache.sling.models.integration-tests
<<<
[INFO] 
[INFO] --- maven-source-plugin:2.4:jar (attach-sources) @ org.apache.sling.models.integration-tests
---
[INFO] Building jar: <https://builds.apache.org/job/sling-bundles-extensions-models-integration-tests-1.7/ws/target/org.apache.sling.models.integration-tests-0.0.1-SNAPSHOT-sources.jar>
[INFO] 
[INFO] --- maven-site-plugin:3.4:attach-descriptor (attach-descriptor) @ org.apache.sling.models.integration-tests
---
[INFO] 
[INFO] --- maven-failsafe-plugin:2.18.1:integration-test (integration-test) @ org.apache.sling.models.integration-tests
---
[INFO] Failsafe report directory: <https://builds.apache.org/job/sling-bundles-extensions-models-integration-tests-1.7/ws/target/failsafe-reports>

-------------------------------------------------------
 T E S T S
-------------------------------------------------------
130 [main] INFO org.apache.sling.models.it.RemoteIT - Server base URL=http://localhost:55738
167 [main] INFO org.apache.sling.testing.tools.jarexec.JarExecutor - Executable jar options:
-p 55738
168 [main] INFO org.apache.sling.testing.tools.jarexec.JarExecutor - Executing asynchronously:
/usr/local/asfpackages/java/jdk1.7.0_80/jre/bin/java -Xmx512m -jar <https://builds.apache.org/job/sling-bundles-extensions-models-integration-tests-1.7/ws/target/dependency/org.apache.sling.launchpad-7-standalone.jar>
-p 55738
170 [main] INFO org.apache.sling.testing.tools.jarexec.JarExecutor - Setting up ProcessDestroyer
with waitOnShutdown=false
172 [main] INFO org.apache.sling.testing.tools.sling.TimeoutsProvider - Timeout factor set
to 1.0 from system property sling.testing.timeout.multiplier
172 [main] INFO org.apache.sling.models.it.RemoteIT - Will wait up to 60 seconds for server
to become ready
175 [main] INFO org.apache.sling.models.it.RemoteIT - Checking that GET requests return expected
content (timeout=60 seconds): [/:script src="system/sling.js", /.explorer.html:href="/libs/sling/explorer/css/explorer.css",
/sling-test/sling/sling-test.html:Sling client library tests]
19.12.2016 10:02:08.799 *INFO * [main] Setting sling.home=sling (default)
19.12.2016 10:02:08.800 *INFO * [main] Starting Apache Sling in <https://builds.apache.org/job/sling-bundles-extensions-models-integration-tests-1.7/ws/sling>
19.12.2016 10:02:08.806 *INFO * [main] Sling  Extension Lib Home : <https://builds.apache.org/job/sling-bundles-extensions-models-integration-tests-1.7/ws/sling/ext>
19.12.2016 10:02:08.808 *INFO * [main] Checking launcher JAR in folder <https://builds.apache.org/job/sling-bundles-extensions-models-integration-tests-1.7/ws/sling>
19.12.2016 10:02:08.821 *INFO * [main] Installing new launcher: jar:<https://builds.apache.org/job/sling-bundles-extensions-models-integration-tests-1.7/ws/target/dependency/org.apache.sling.launchpad-7-standalone.jar!/resources/org.apache.sling.launchpad.base.jar,>
4.4.1.2_5_2 (org.apache.sling.launchpad.base.jar.1482141728821)
19.12.2016 10:02:08.824 *INFO * [main] Loading launcher class org.apache.sling.launchpad.base.app.MainDelegate
from org.apache.sling.launchpad.base.jar.1482141728821
19.12.2016 10:02:08.826 *INFO * [main] External Libs Home (ext) is null or does not exists.
19.12.2016 10:02:08.849 *INFO * [main] Setting sling.launchpad=<https://builds.apache.org/job/sling-bundles-extensions-models-integration-tests-1.7/ws/sling>
19.12.2016 10:02:08.849 *INFO * [main] Setting org.osgi.service.http.port=55738
19.12.2016 10:02:08.850 *INFO * [main] Starting launcher ...
19.12.2016 10:02:08.852 *INFO * [main] HTTP server port: 55738
19.12.2016 10:02:10.413 *INFO* [FelixStartLevel] org.apache.sling.commons.log.logback.internal.Activator
LogbackManager initialized at bundle startup
19.12.2016 10:02:10.459 *INFO* [OsgiInstallerImpl] org.apache.sling.installer.core.impl.OsgiInstallerImpl
Apache Sling OSGi Installer Service started.
19.12.2016 10:02:10.954 *INFO * [main] Startup completed
60226 [main] INFO org.apache.sling.models.it.RemoteIT - Server not ready after 60 seconds,
giving up

Results :

Tests run: 0, Failures: 0, Errors: 0, Skipped: 0

[JENKINS] Recording test results
[JENKINS] Archiving disabled
[JENKINS] Archiving disabled[INFO] ------------------------------------------------------------------------
[INFO] BUILD FAILURE
[INFO] ------------------------------------------------------------------------
[INFO] Total time: 01:22 min
[INFO] Finished at: 2016-12-19T10:03:09+00:00

[INFO] Final Memory: 49M/723M
[INFO] ------------------------------------------------------------------------
Waiting for Jenkins to finish collecting data[ERROR] Failed to execute goal org.apache.maven.plugins:maven-failsafe-plugin:2.18.1:integration-test
(integration-test) on project org.apache.sling.models.integration-tests: Execution integration-test
of goal org.apache.maven.plugins:maven-failsafe-plugin:2.18.1:integration-test failed: There
was an error in the forked process
[ERROR] java.lang.AssertionError: Server not ready after 60 seconds, giving up
[ERROR] at org.junit.Assert.fail(Assert.java:88)
[ERROR] at org.apache.sling.testing.tools.sling.SlingTestBase.waitForServerReady(SlingTestBase.java:326)
[ERROR] at org.apache.sling.testing.tools.sling.SlingTestBase.startServerIfNeeded(SlingTestBase.java:169)
[ERROR] at org.apache.sling.testing.tools.sling.SlingTestBase.getServerBaseUrl(SlingTestBase.java:231)
[ERROR] at org.apache.sling.models.it.RemoteIT.getJunitServletUrl(RemoteIT.java:28)
[ERROR] at org.apache.sling.junit.remote.testrunner.SlingRemoteTestRunner.maybeExecuteTests(SlingRemoteTestRunner.java:95)
[ERROR] at org.apache.sling.junit.remote.testrunner.SlingRemoteTestRunner.getChildren(SlingRemoteTestRunner.java:138)
[ERROR] at org.junit.runners.ParentRunner.getFilteredChildren(ParentRunner.java:426)
[ERROR] at org.junit.runners.ParentRunner.getDescription(ParentRunner.java:351)
[ERROR] at org.junit.runners.Suite.describeChild(Suite.java:123)
[ERROR] at org.junit.runners.Suite.describeChild(Suite.java:27)
[ERROR] at org.junit.runners.ParentRunner.getDescription(ParentRunner.java:352)
[ERROR] at org.apache.maven.surefire.common.junit4.JUnit4ProviderUtil.createSuiteDescription(JUnit4ProviderUtil.java:113)
[ERROR] at org.apache.maven.surefire.junit4.JUnit4Provider.createTestsDescription(JUnit4Provider.java:257)
[ERROR] at org.apache.maven.surefire.junit4.JUnit4Provider.invoke(JUnit4Provider.java:124)
[ERROR] at org.apache.maven.surefire.booter.ForkedBooter.invokeProviderInSameClassLoader(ForkedBooter.java:203)
[ERROR] at org.apache.maven.surefire.booter.ForkedBooter.runSuitesInProcess(ForkedBooter.java:155)
[ERROR] at org.apache.maven.surefire.booter.ForkedBooter.main(ForkedBooter.java:103)
[ERROR] -> [Help 1]
[ERROR] 
[ERROR] To see the full stack trace of the errors, re-run Maven with the -e switch.
[ERROR] Re-run Maven using the -X switch to enable full debug logging.
[ERROR] 
[ERROR] For more information about the errors and possible solutions, please read the following
articles:
[ERROR] [Help 1] http://cwiki.apache.org/confluence/display/MAVEN/PluginExecutionException

channel stopped
Recording test results

Mime
View raw message